{"text_format":"1","workbook":"xlsx","n_sheets":26,"sheets":["Form 1 Main","Form 1 Assets","Form 1 Liabilities","Declaration","Form 2","Form 3","Form 4 Table 1","Form 4 Table 2","Form 5","Form 6","Form 7","Form 8 Table 1","Form 8 Table 2","Form 9","Form 10 Table 1","Form 10 Table 2","Form 10 Table 3","Form 10 Table 4","Form 10 Table 5","Form 10 Table 6","Form 11","Form 12","MIC Config","Config","Error Message","Label Mapping"],"not_rendered":{"charts":0,"images":90,"macros":1,"external_links":0,"defined_names":1115,"comments":0,"pivot_tables":0},"unopened":[],"bounds":{"document_bytes":16777216,"sheet_cells":100000,"rows_first":2000,"rows_last":500,"rows_between":2000,"halvings":0,"cell_chars":16384,"cell_head_chars":4096},"cells_cut":0,"cells_raw":0,"read":"whole","date_system":"1900"}

{"sheet":"Form 1 Main","index":0,"n_rows":78,"n_cols":12,"rows_kept":78,"cut":false,"hidden":false,"merged":[[73,2,73,8],[25,2,25,9],[2,3,2,10],[1,4,1,9],[77,1,77,4],[4,4,4,7],[75,2,75,8],[15,6,15,8],[13,6,13,8],[17,6,17,8],[22,6,22,8],[5,1,5,10],[76,2,76,8],[9,1,9,7],[52,3,52,8],[55,3,55,8],[53,3,54,8],[56,3,57,8]]}
[null,null,null,null,null,null,null,null,null,null,{"$f":"IF(ISBLANK(Config!C7),\"\",Config!C7)","v":""}]
[null,null,null,null,"SECURITIES AND FUTURES ORDINANCE (CAP.571)"]
[null,null,null,"SECURITIES AND FUTURES (FINANCIAL RESOURCES) RULES (CAP.571N)"]
[null,null,null,null,"    *",null,"[1000]","FINANCIAL RETURN (Note 1)"]
[]
[null,"(Made for the purposes of compliance with the requirements of section 145 of the Securities and Futures Ordinance (Cap.571) as amplified in section 56 of the Securities and Futures (Financial Resources) Rules (Cap.571N), \"FRR\")"]
[]
[]
[null,"FORM 1","LIQUID CAPITAL COMPUTATION"]
[]
[]
[]
[]
[null,"(1)","Name of licensed corporation",null,null,null,"",null,null,"[1001]"]
[]
[null,null,"CE number",null,null,null,"",null,null,"[1002]"]
[]
[null,"(2)","Business name",null,null,null,"",null,null,"[1003]"]
[null,null,"(if different from item (1))"]
[]
[null,"(3)","Reporting month (mm/yyyy)",null,null,null,null,null,null,"[1004]",null,""]
[]
[null,null,"Please specify the reporting date (dd/mmm/yyyy)",null,null,null,null,null,null,"[1005]"]
[null,null,"if the financial return is not made up to the calendar month-end date"]
[]
[null,"(4)","Type(s) of regulated activity(ies) / virtual asset service for which the licensed corporation is licensed (select where appropriate)"]
[]
[null,null,"Type 1:"]
[null,null,null,"(a)  Dealing in securities and it does not provide securities margin financing",null,null,null,null,null,null,"[1006A]","N"]
[null,null,null,"(b)  Dealing in securities and it provides securities margin financing",null,null,null,null,null,null,"[1006B]","N"]
[null,null,null,"(c)  Dealing in securities solely as a trader",null,null,null,null,null,null,"[1006C]","N"]
[null,null,null,"(d)  Dealing in securities solely as an approved introducing agent",null,null,null,null,null,null,"[1006D]","N"]
[]
[null,null,"Type 2:"]
[null,null,null,"(a)  Dealing in futures contracts",null,null,null,null,null,null,"[1006E]","N"]
[null,null,null,"(b)  Dealing in futures contracts as a futures non-clearing dealer",null,null,null,null,null,null,"[1006F]","N"]
[null,null,null,"(c)  Dealing in futures contracts solely as a trader",null,null,null,null,null,null,"[1006G]","N"]
[null,null,null,"(d)  Dealing in futures contracts solely as an approved introducing agent",null,null,null,null,null,null,"[1006H]","N"]
[]
[null,null,"Type 3:"]
[null,null,null,"(a)  Leveraged foreign exchange trading",null,null,null,null,null,null,"[1006I]","N"]
[null,null,null,"(b)  Leveraged foreign exchange trading solely as an approved introducing agent",null,null,null,null,null,null,"[1006J]","N"]
[]
[null,null,"Type 4: "]
[null,null,null,"(a)  Advising on securities and it is subject to specified licensing condition (Note 2)",null,null,null,null,null,null,"[1006K]","N"]
[null,null,null,"(b)  Advising on securities and it is not subject to specified licensing condition",null,null,null,null,null,null,"[1006L]","N"]
[]
[null,null,"Type 5: "]
[null,null,null,"(a)  Advising on futures contracts and it is subject to specified licensing condition",null,null,null,null,null,null,"[1006M]","N"]
[null,null,null,"(b)  Advising on futures contracts and it is not subject to specified licensing condition",null,null,null,null,null,null,"[1006N]","N"]
[]
[null,null,"Type 6:"]
[null,null,null,"(a)  Advising on corporate finance and it is subject to specified licensing condition but not\n       subject to no sponsor work licensing condition (Note 2)",null,null,null,null,null,null,"[1006O]","N"]
[null,null,null,"(b)  Advising on corporate finance and it is subject to specified licensing condition and no\n       sponsor work licensing condition",null,null,null,null,null,null,"[1006O1]","N"]
[]
[null,null,null,"(c)  Advising on corporate finance and it is not subject to specified licensing condition but\n       subject to no sponsor work licensing condition",null,null,null,null,null,null,"[1006P]","N"]
[null,null,null,"(d)  Advising on corporate finance and it is not subject to specified licensing condition and\n       no sponsor work licensing condition",null,null,null,null,null,null,"[1006P1]","N"]
[]
[]
[null,null,"Type 7:"]
[null,null,null,"Providing automated trading services",null,null,null,null,null,null,"[1006Q]","N"]
[]
[null,null,"Type 8:"]
[null,null,null,"Securities margin financing",null,null,null,null,null,null,"[1006R]","N"]
[]
[null,null,"Type 9:"]
[null,null,null,"(a)  Asset management and it is subject to specified licensing condition",null,null,null,null,null,null,"[1006S]","N"]
[null,null,null,"(b)  Asset management and it is not subject to specified licensing condition",null,null,null,null,null,null,"[1006T]","N"]
[]
[null,null,"Type 10:"]
[null,null,null,"(a)  Providing credit rating services and it is subject to specified licensing condition",null,null,null,null,null,null,"[1006U]","N"]
[null,null,null,"(b)  Providing credit rating services and it is not subject to specified licensing condition",null,null,null,null,null,null,"[1006V]","N"]
[]
[null,null,"Licensed under the Anti-Money Laundering and Counter-Terrorist Financing Ordinance (\"AMLO\") as licensed provider",null,null,null,null,null,null,null,"[1006W]","N"]
[]
[null,"Note 1: ","The financial return is to be submitted on semi-annual basis by a licensed corporation licensed for one or more of the regulated activities of advising on securities, advising on futures contracts, advising on corporate finance and/or asset management and where the licensed corporation is subject to specified licensing condition.  Other licensed corporations shall submit the financial returns on monthly basis, save for some forms which are due on quarterly basis.  Please refer to section 56 of the Securities and Futures (Financial Resources) Rules for submission requirements for licensed corporation.\n"]
[null,"Note 2: ","Please refer to section 2(1) of the Securities and Futures (Financial Resources) Rules for the definitions of \"specified licensing condition\" and \"no sponsor work licensing condition\". "]
[null,"        * Select where appropriate"]

{"sheet":"Form 1 Assets","index":1,"n_rows":105,"n_cols":10,"rows_kept":105,"cut":false,"hidden":false,"merged":[[71,2,71,3],[69,9,70,9],[12,9,15,9],[16,6,20,6],[16,9,20,9],[64,7,65,7],[64,8,65,8],[66,7,67,7],[66,8,67,8],[16,8,20,8],[41,8,45,8],[69,6,70,6],[38,7,40,7],[38,8,40,8],[0,0,0,4],[51,7,59,7],[51,8,59,8],[21,7,25,7],[21,8,25,8],[26,7,29,7],[26,8,29,8],[41,7,45,7],[30,7,33,7],[3,7,3,8],[16,2,16,3],[21,4,22,4],[34,7,37,7],[9,4,10,4],[4,4,5,4],[4,2,4,3],[103,7,106,7],[103,8,106,8],[101,7,102,7],[101,8,102,8],[97,7,100,7],[97,8,100,8],[9,7,11,7],[9,8,11,8],[12,7,15,7],[12,8,15,8],[46,8,50,8],[16,7,20,7],[46,7,50,7],[103,9,106,9],[12,6,15,6],[88,9,90,9],[97,6,100,6],[95,7,96,7],[95,8,96,8],[75,8,76,8],[88,7,90,7],[88,8,90,8],[77,7,82,7],[77,8,82,8],[84,7,85,7],[84,8,85,8],[75,7,76,7],[62,7,63,7],[69,7,70,7],[83,4,84,4],[16,4,17,4],[30,8,33,8],[34,8,37,8],[62,8,63,8],[69,8,70,8]]}
[{"$f":"IF(ISBLANK('Form 1 Main'!G14),\"\",\"Financial return of\")&\" \"&IF(ISBLANK('Form 1 Main'!G14),\"\",'Form 1 Main'!G14)&\" as of the end of reporting month \"&IF(ISBLANK('Form 1 Main'!L21),\"\",'Form 1 Main'!L21)","v":"Financial return of  as of the end of reporting month "},null,null,null,null,null,null,null,null,{"$f":"IF(ISBLANK(Config!C7),\"\",Config!C7)","v":""}]
[]
[]
[null,null,null,null,null,null,null,"Amounts included in"]
[null,"Item","Assets",null,"section ref.\n(Note 3)",null,null,"Liquid capital computation","Balance sheet"]
[null,null,null,null,null,null,null,"(HK$'000)","(HK$'000)"]
[null,5,"Cash in hand and at bank ",null,"20"]
[null,null,"-","bank balances held in segregated accounts ",null,null,"[1007]",0,0,"[1008]"]
[null,null,"-","bank balances held in other accounts and cash in hand (Note 4)",null,null,"[1009]",0,0,"[1010]"]
[null,6,"Amounts receivable from",null,"22(1) & (2)",null,null,0,0]
[null,null,null,"margin clients (Note 5)"]
[null,null,null,null,null,null,"[1011]",null,null,"[1012]"]
[null,7,"Amounts receivable from",null,"21(5)",null,"[1013]",0,0,"[1014]"]
[null,null,null,"clients for subscription of securities"]
[]
[]
[null,"8","Amounts receivable from ",null,"21(2), (3) & (6)",null,"[1015]",0,0,"[1016]"]
[null,null,null,"rolling balance cash clients"]
[]
[]
[]
[null,"9","Other amounts",null,"21(1), (4) & (6)",null,null,0,0]
[null,null,null,"receivable from clients arising from"]
[null,null,null,"dealing in securities"]
[]
[null,null,null,null,null,null,"[1017]",null,null,"[1018]"]
[null,"10","Amounts receivable from",null,"24(2) & 25",null,null,0,0]
[null,null,null,"licensed corporations licensed"]
[null,null,null,"for securities margin financing"]
[null,null,null,null,null,null,"[1019]",null,null,"[1020]"]
[null,"11","Proprietary positions in",null,"27",null,null,0,0]
[null,null,null,"securities and specified investments (Note 6)"]
[]
[null,null,null,null,null,null,"[1021]",null,null,"[1022]"]
[null,"12","Proprietary positions in",null,"31",null,null,0,0]
[null,null,null,"exchange-traded unlisted options contracts"]
[]
[null,null,null,null,null,null,"[1023]",null,null,"[1024]"]
[null,"12A","Proprietary positions in",null,null,null,null,0,0]
[null,null,null,"virtual assets"]
[null,null,null,null,null,null,"[1024A]",null,null,"[1024B]"]
[null,"13","Amounts receivable from",null,"30",null,null,0,0]
[null,null,null,"clients arising from dealing in exchange-traded"]
[null,null,null,"unlisted options contracts"]
[]
[null,null,null,null,null,null,"[1025]",null,null,"[1026]"]
[null,"14","Amounts receivable from",null,"23 & 24(1)",null,null,0,0]
[null,null,null,"other dealers and clearing participants etc. "]
[null,null,null,"in respect of securities"]
[]
[null,null,null,null,null,null,"[1027]",null,null,"[1028]"]
[null,"15","Amounts receivable from",null,"29",null,null,0,0]
[null,null,null,"other dealers and clearing participants in "]
[null,null,null,"respect of futures, unlisted options and "]
[null,null,null,"leverage foreign exchange contracts"]
[]
[]
[]
[]
[null,null,null,null,null,null,"[1029]",null,null,"[1030]"]
[null,"16","Amounts receivable from",null,"28"]
[null,null,null,"clearing houses"]
[null,null,null,"- Hong Kong Securities Clearing ",null,null,null,0,0]
[null,null,null,"  Company Limited (\"HKSCC\")",null,null,"[1031]",null,null,"[1032]"]
[null,null,null,"- The SEHK Options Clearing ",null,null,null,0,0]
[null,null,null,"  House Limited (\"SEOCH\")",null,null,"[1033]",null,null,"[1034]"]
[null,null,null,"- HKFE Clearing Corporation ",null,null,null,0,0]
[null,null,null,"  Limited (\"HKFECC\")",null,null,"[1035]",null,null,"[1036]"]
[null,null,null,"- Euroclear Bank S.A./N.V.,\n  Euroclear France S.A.,\n  Clearstream Banking S.A.,\n  Clearstream Banking AG or\n  Korea Securities Finance Corporation",null,null,"[1037]",0,0,"[1038]"]
[null,null,null,"- other clearing houses",null,null,"[1039]",0,0,"[1040]"]
[]
[null,"16A","Amounts receivable from virtual asset trading platforms"]
[null,null,null,"- licensed providers licensed under AMLO",null,null,"[1040A]",0,0,"[1040B]"]
[null,null,null,"- virtual asset trading platforms other than\n  licensed providers licensed under AMLO",null,null,"[1040C]",0,0,"[1040D]"]
[]
[]
[]
[null,"17","Amounts receivable from ",null,"34",null,null,0,0]
[null,null,null,"recognized counterparties"]
[null,null,null,"and floating profits in respect"]
[null,null,null,"of open positions arising from"]
[null,null,null,"leveraged foreign exchange trading"]
[null,null,null,null,null,null,"[1041]",null,null,"[1042]"]
[null,"18","Other assets arising from",null,"26, 32, 33 & 35"]
[null,null,null,"- advising on securities",null,null,null,0,0]
[null,null,null,"  and/or futures contracts",null,null,"[1043]",null,null,"[1044]"]
[null,null,null,"- advising on corporate finance",null,null,"[1045]",0,0,"[1046]"]
[null,null,null,"- asset management",null,null,"[1047]",0,0,"[1048]"]
[null,null,null,"- amounts receivable from group",null,null,null,null,0,"[1049]"]
[null,null,null,"  companies or other related parties"]
[]
[null,null,null,"- provision of credit rating services",null,null,"[1049A]",0,0,"[1049B]"]
[null,null,null,"- securities borrowing and lending agreements",null,null,"[1049C]",0,0,"[1049D]"]
[null,null,null,"- repurchase transactions",null,null,"[1049E]",0,0,"[1049F]"]
[null,null,null,"- provision of virtual asset services",null,null,"[1049G]",0,0,"[1049H]"]
[null,null,null,"- others",null,null,null,0,0]
[null,null,null,null,null,null,"[1050]",null,null,"[1051]"]
[null,"19","Total liquid assets",null,null,null,"[1052]",{"$f":"SUM(H8:H97)","v":0}]
[null,null,null,"(aggregate of amounts in items 5 to 18)"]
[]
[]
[null,"20","Fixed assets",null,null,null,null,null,0]
[null,null,null,null,null,null,null,null,null,"[1053]"]
[null,"21","Total assets (aggregate of amounts in items",null,null,null,null,null,{"$f":"SUM(I8:I103)","v":0},"[1054]"]
[null,null,null,"5 to 18 & 20)"]

{"sheet":"Form 1 Liabilities","index":2,"n_rows":5196,"n_cols":12,"rows_kept":5196,"cut":false,"hidden":false,"merged":[[143,5,143,6],[144,5,144,6],[145,5,145,6],[146,5,146,6],[147,5,147,6],[148,5,148,6],[168,2,168,8],[142,2,142,8],[4767,4,4767,6],[4768,4,4768,6],[4769,4,4769,6],[4758,4,4758,6],[4759,4,4759,6],[4760,4,4760,6],[4761,4,4761,6],[4762,4,4762,6],[4763,4,4763,6],[4764,4,4764,6],[4765,4,4765,6],[4766,4,4766,6],[4749,4,4749,6],[4750,4,4750,6],[4751,4,4751,6],[4752,4,4752,6],[4753,4,4753,6],[4754,4,4754,6],[4755,4,4755,6],[4756,4,4756,6],[4757,4,4757,6],[4740,4,4740,6],[4741,4,4741,6],[4742,4,4742,6],[4743,4,4743,6],[4744,4,4744,6],[4745,4,4745,6],[4746,4,4746,6],[4747,4,4747,6],[4748,4,4748,6],[4731,4,4731,6],[4732,4,4732,6],[4733,4,4733,6],[4734,4,4734,6],[4735,4,4735,6],[4736,4,4736,6],[4737,4,4737,6],[4738,4,4738,6],[4739,4,4739,6],[4722,4,4722,6],[4723,4,4723,6],[4724,4,4724,6],[4725,4,4725,6],[4726,4,4726,6],[4727,4,4727,6],[4728,4,4728,6],[4729,4,4729,6],[4730,4,4730,6],[4713,4,4713,6],[4714,4,4714,6],[4715,4,4715,6],[4716,4,4716,6],[4717,4,4717,6],[4718,4,4718,6],[4719,4,4719,6],[4720,4,4720,6],[4721,4,4721,6],[4704,4,4704,6],[4705,4,4705,6],[4706,4,4706,6],[4707,4,4707,6],[4708,4,4708,6],[4709,4,4709,6],[4710,4,4710,6],[4711,4,4711,6],[4712,4,4712,6],[4695,4,4695,6],[4696,4,4696,6],[4697,4,4697,6],[4698,4,4698,6],[4699,4,4699,6],[4700,4,4700,6],[4701,4,4701,6],[4702,4,4702,6],[4703,4,4703,6],[4686,4,4686,6],[4687,4,4687,6],[4688,4,4688,6],[4689,4,4689,6],[4690,4,4690,6],[4691,4,4691,6],[4692,4,4692,6],[4693,4,4693,6],[4694,4,4694,6],[4677,4,4677,6],[4678,4,4678,6],[4679,4,4679,6],[4680,4,4680,6],[4681,4,4681,6],[4682,4,4682,6],[4683,4,4683,6],[4684,4,4684,6],[4685,4,4685,6],[4668,4,4668,6],[4669,4,4669,6],[4670,4,4670,6],[4671,4,4671,6],[4672,4,4672,6],[4673,4,4673,6],[4674,4,4674,6],[4675,4,4675,6],[4676,4,4676,6],[4659,4,4659,6],[4660,4,4660,6],[4661,4,4661,6],[4662,4,4662,6],[4663,4,4663,6],[4664,4,4664,6],[4665,4,4665,6],[4666,4,4666,6],[4667,4,4667,6],[4650,4,4650,6],[4651,4,4651,6],[4652,4,4652,6],[4653,4,4653,6],[4654,4,4654,6],[4655,4,4655,6],[4656,4,4656,6],[4657,4,4657,6],[4658,4,4658,6],[4641,4,4641,6],[4642,4,4642,6],[4643,4,4643,6],[4644,4,4644,6],[4645,4,4645,6],[4646,4,4646,6],[4647,4,4647,6],[4648,4,4648,6],[4649,4,4649,6],[4632,4,4632,6],[4633,4,4633,6],[4634,4,4634,6],[4635,4,4635,6],[4636,4,4636,6],[4637,4,4637,6],[4638,4,4638,6],[4639,4,4639,6],[4640,4,4640,6],[4623,4,4623,6],[4624,4,4624,6],[4625,4,4625,6],[4626,4,4626,6],[4627,4,4627,6],[4628,4,4628,6],[4629,4,4629,6],[4630,4,4630,6],[4631,4,4631,6],[4614,4,4614,6],[4615,4,4615,6],[4616,4,4616,6],[4617,4,4617,6],[4618,4,4618,6],[4619,4,4619,6],[4620,4,4620,6],[4621,4,4621,6],[4622,4,4622,6],[4605,4,4605,6],[4606,4,4606,6],[4607,4,4607,6],[4608,4,4608,6],[4609,4,4609,6],[4610,4,4610,6],[4611,4,4611,6],[4612,4,4612,6],[4613,4,4613,6],[4596,4,4596,6],[4597,4,4597,6],[4598,4,4598,6],[4599,4,4599,6],[4600,4,4600,6],[4601,4,4601,6],[4602,4,4602,6],[4603,4,4603,6],[4604,4,4604,6],[4587,4,4587,6],[4588,4,4588,6],[4589,4,4589,6],[4590,4,4590,6],[4591,4,4591,6],[4592,4,4592,6],[4593,4,4593,6],[4594,4,4594,6],[4595,4,4595,6],[4578,4,4578,6],[4579,4,4579,6],[4580,4,4580,6],[4581,4,4581,6],[4582,4,4582,6],[4583,4,4583,6],[4584,4,4584,6],[4585,4,4585,6],[4586,4,4586,6],[4569,4,4569,6],[4570,4,4570,6],[4571,4,4571,6],[4572,4,4572,6],[4573,4,4573,6],[4574,4,4574,6],[4575,4,4575,6],[4576,4,4576,6],[4577,4,4577,6],[4560,4,4560,6],[4561,4,4561,6],[4562,4,4562,6],[4563,4,4563,6],[4564,4,4564,6],[4565,4,4565,6],[4566,4,4566,6],[4567,4,4567,6],[4568,4,4568,6],[4551,4,4551,6],[4552,4,4552,6],[4553,4,4553,6],[4554,4,4554,6],[4555,4,4555,6],[4556,4,4556,6],[4557,4,4557,6],[4558,4,4558,6],[4559,4,4559,6],[4542,4,4542,6],[4543,4,4543,6],[4544,4,4544,6],[4545,4,4545,6],[4546,4,4546,6],[4547,4,4547,6],[4548,4,4548,6],[4549,4,4549,6],[4550,4,4550,6],[4533,4,4533,6],[4534,4,4534,6],[4535,4,4535,6],[4536,4,4536,6],[4537,4,4537,6],[4538,4,4538,6],[4539,4,4539,6],[4540,4,4540,6],[4541,4,4541,6],[4524,4,4524,6],[4525,4,4525,6],[4526,4,4526,6],[4527,4,4527,6],[4528,4,4528,6],[4529,4,4529,6],[4530,4,4530,6],[4531,4,4531,6],[4532,4,4532,6],[4515,4,4515,6],[4516,4,4516,6],[4517,4,4517,6],[4518,4,4518,6],[4519,4,4519,6],[4520,4,4520,6],[4521,4,4521,6],[4522,4,4522,6],[4523,4,4523,6],[4506,4,4506,6],[4507,4,4507,6],[4508,4,4508,6],[4509,4,4509,6],[4510,4,4510,6],[4511,4,4511,6],[4512,4,4512,6],[4513,4,4513,6],[4514,4,4514,6],[4497,4,4497,6],[4498,4,4498,6],[4499,4,4499,6],[4500,4,4500,6],[4501,4,4501,6],[4502,4,4502,6],[4503,4,4503,6],[4504,4,4504,6],[4505,4,4505,6],[4488,4,4488,6],[4489,4,4489,6],[4490,4,4490,6],[4491,4,4491,6],[4492,4,4492,6],[4493,4,4493,6],[4494,4,4494,6],[4495,4,4495,6],[4496,4,4496,6],[4479,4,4479,6],[4480,4,4480,6],[4481,4,4481,6],[4482,4,4482,6],[4483,4,4483,6],[4484,4,4484,6],[4485,4,4485,6],[4486,4,4486,6],[4487,4,4487,6],[4470,4,4470,6],[4471,4,4471,6],[4472,4,4472,6],[4473,4,4473,6],[4474,4,4474,6],[4475,4,4475,6],[4476,4,4476,6],[4477,4,4477,6],[4478,4,4478,6],[4461,4,4461,6],[4462,4,4462,6],[4463,4,4463,6],[4464,4,4464,6],[4465,4,4465,6],[4466,4,4466,6],[4467,4,4467,6],[4468,4,4468,6],[4469,4,4469,6],[4452,4,4452,6],[4453,4,4453,6],[4454,4,4454,6],[4455,4,4455,6],[4456,4,4456,6],[4457,4,4457,6],[4458,4,4458,6],[4459,4,4459,6],[4460,4,4460,6],[4443,4,4443,6],[4444,4,4444,6],[4445,4,4445,6],[4446,4,4446,6],[4447,4,4447,6],[4448,4,4448,6],[4449,4,4449,6],[4450,4,4450,6],[4451,4,4451,6],[4434,4,4434,6],[4435,4,4435,6],[4436,4,4436,6],[4437,4,4437,6],[4438,4,4438,6],[4439,4,4439,6],[4440,4,4440,6],[4441,4,4441,6],[4442,4,4442,6],[4425,4,4425,6],[4426,4,4426,6],[4427,4,4427,6],[4428,4,4428,6],[4429,4,4429,6],[4430,4,4430,6],[4431,4,4431,6],[4432,4,4432,6],[4433,4,4433,6],[4416,4,4416,6],[4417,4,4417,6],[4418,4,4418,6],[4419,4,4419,6],[4420,4,4420,6],[4421,4,4421,6],[4422,4,4422,6],[4423,4,4423,6],[4424,4,4424,6],[4407,4,4407,6],[4408,4,4408,6],[4409,4,4409,6],[4410,4,4410,6],[4411,4,4411,6],[4412,4,4412,6],[4413,4,4413,6],[4414,4,4414,6],[4415,4,4415,6],[4398,4,4398,6],[4399,4,4399,6],[4400,4,4400,6],[4401,4,4401,6],[4402,4,4402,6],[4403,4,4403,6],[4404,4,4404,6],[4405,4,4405,6],[4406,4,4406,6],[4389,4,4389,6],[4390,4,4390,6],[4391,4,4391,6],[4392,4,4392,6],[4393,4,4393,6],[4394,4,4394,6],[4395,4,4395,6],[4396,4,4396,6],[4397,4,4397,6],[4380,4,4380,6],[4381,4,4381,6],[4382,4,4382,6],[4383,4,4383,6],[4384,4,4384,6],[4385,4,4385,6],[4386,4,4386,6],[4387,4,4387,6],[4388,4,4388,6],[4371,4,4371,6],[4372,4,4372,6],[4373,4,4373,6],[4374,4,4374,6],[4375,4,4375,6],[4376,4,4376,6],[4377,4,4377,6],[4378,4,4378,6],[4379,4,4379,6],[4362,4,4362,6],[4363,4,4363,6],[4364,4,4364,6],[4365,4,4365,6],[4366,4,4366,6],[4367,4,4367,6],[4368,4,4368,6],[4369,4,4369,6],[4370,4,4370,6],[4353,4,4353,6],[4354,4,4354,6],[4355,4,4355,6],[4356,4,4356,6],[4357,4,4357,6],[4358,4,4358,6],[4359,4,4359,6],[4360,4,4360,6],[4361,4,4361,6],[4344,4,4344,6],[4345,4,4345,6],[4346,4,4346,6],[4347,4,4347,6],[4348,4,4348,6],[4349,4,4349,6],[4350,4,4350,6],[4351,4,4351,6],[4352,4,4352,6],[4335,4,4335,6],[4336,4,4336,6],[4337,4,4337,6],[4338,4,4338,6],[4339,4,4339,6],[4340,4,4340,6],[4341,4,4341,6],[4342,4,4342,6],[4343,4,4343,6],[4326,4,4326,6],[4327,4,4327,6],[4328,4,4328,6],[4329,4,4329,6],[4330,4,4330,6],[4331,4,4331,6],[4332,4,4332,6],[4333,4,4333,6],[4334,4,4334,6],[4317,4,4317,6],[4318,4,4318,6],[4319,4,4319,6],[4320,4,4320,6],[4321,4,4321,6],[4322,4,4322,6],[4323,4,4323,6],[4324,4,4324,6],[4325,4,4325,6],[4308,4,4308,6],[4309,4,4309,6],[4310,4,4310,6],[4311,4,4311,6],[4312,4,4312,6],[4313,4,4313,6],[4314,4,4314,6],[4315,4,4315,6],[4316,4,4316,6],[4299,4,4299,6],[4300,4,4300,6],[4301,4,4301,6],[4302,4,4302,6],[4303,4,4303,6],[4304,4,4304,6],[4305,4,4305,6],[4306,4,4306,6],[4307,4,4307,6],[4290,4,4290,6],[4291,4,4291,6],[4292,4,4292,6],[4293,4,4293,6],[4294,4,4294,6],[4295,4,4295,6],[4296,4,4296,6],[4297,4,4297,6],[4298,4,4298,6],[4281,4,4281,6],[4282,4,4282,6],[4283,4,4283,6],[4284,4,4284,6],[4285,4,4285,6],[4286,4,4286,6],[4287,4,4287,6],[4288,4,4288,6],[4289,4,4289,6],[4865,4,4865,6],[4866,4,4866,6],[4867,4,4867,6],[4868,4,4868,6],[4869,4,4869,6],[4270,4,4270,6],[4271,4,4271,6],[4272,4,4272,6],[4273,4,4273,6],[4274,4,4274,6],[4275,4,4275,6],[4276,4,4276,6],[4277,4,4277,6],[4278,4,4278,6],[4279,4,4279,6],[4280,4,4280,6],[4856,4,4856,6],[4857,4,4857,6],[4858,4,4858,6],[4859,4,4859,6],[4860,4,4860,6],[4861,4,4861,6],[4862,4,4862,6],[4837,4,4837,6],[4820,4,4820,6],[4821,4,4821,6],[4822,4,4822,6],[4823,4,4823,6],[4824,4,4824,6],[4825,4,4825,6],[4826,4,4826,6],[4827,4,4827,6],[4828,4,4828,6],[4863,4,4863,6],[4864,4,4864,6],[4847,4,4847,6],[4848,4,4848,6],[4849,4,4849,6],[4850,4,4850,6],[4851,4,4851,6],[4852,4,4852,6],[4853,4,4853,6],[4854,4,4854,6],[4855,4,4855,6],[4838,4,4838,6],[4839,4,4839,6],[4840,4,4840,6],[4841,4,4841,6],[4842,4,4842,6],[4843,4,4843,6],[4844,4,4844,6],[4845,4,4845,6],[4846,4,4846,6],[4802,4,4802,6],[4803,4,4803,6],[4804,4,4804,6],[4805,4,4805,6],[4806,4,4806,6],[4807,4,4807,6],[4808,4,4808,6],[4809,4,4809,6],[4810,4,4810,6],[4829,4,4829,6],[4830,4,4830,6],[4831,4,4831,6],[4832,4,4832,6],[4833,4,4833,6],[4834,4,4834,6],[4835,4,4835,6],[4836,4,4836,6],[5141,4,5141,6],[5142,4,5142,6],[5143,4,5143,6],[5144,4,5144,6],[5145,4,5145,6],[5146,4,5146,6],[5147,4,5147,6],[5148,4,5148,6],[5149,4,5149,6],[5132,4,5132,6],[5133,4,5133,6],[4791,4,4791,6],[4792,4,4792,6],[4793,4,4793,6],[4794,4,4794,6],[4795,4,4795,6],[4796,4,4796,6],[4797,4,4797,6],[4798,4,4798,6],[4799,4,4799,6],[4800,4,4800,6],[4801,4,4801,6],[5134,4,5134,6],[5135,4,5135,6],[5136,4,5136,6],[5137,4,5137,6],[5138,4,5138,6],[5139,4,5139,6],[5140,4,5140,6],[5123,4,5123,6],[5124,4,5124,6],[5125,4,5125,6],[5168,4,5168,6],[5169,4,5169,6],[5159,4,5159,6],[5160,4,5160,6],[5161,4,5161,6],[5162,4,5162,6],[5163,4,5163,6],[5164,4,5164,6],[5165,4,5165,6],[5166,4,5166,6],[5167,4,5167,6],[5150,4,5150,6],[5151,4,5151,6],[5152,4,5152,6],[5153,4,5153,6],[5154,4,5154,6],[5155,4,5155,6],[5156,4,5156,6],[5157,4,5157,6],[5158,4,5158,6],[5126,4,5126,6],[5127,4,5127,6],[5128,4,5128,6],[5129,4,5129,6],[5130,4,5130,6],[5131,4,5131,6],[5114,4,5114,6],[5115,4,5115,6],[5116,4,5116,6],[5117,4,5117,6],[5118,4,5118,6],[5119,4,5119,6],[5120,4,5120,6],[5121,4,5121,6],[5122,4,5122,6],[5105,4,5105,6],[5106,4,5106,6],[5107,4,5107,6],[5108,4,5108,6],[5109,4,5109,6],[5110,4,5110,6],[5111,4,5111,6],[5112,4,5112,6],[5113,4,5113,6],[5096,4,5096,6],[5097,4,5097,6],[5098,4,5098,6],[5099,4,5099,6],[5100,4,5100,6],[5101,4,5101,6],[5102,4,5102,6],[5103,4,5103,6],[5104,4,5104,6],[5087,4,5087,6],[5088,4,5088,6],[5089,4,5089,6],[5090,4,5090,6],[5091,4,5091,6],[5092,4,5092,6],[5093,4,5093,6],[5094,4,5094,6],[5095,4,5095,6],[5078,4,5078,6],[5079,4,5079,6],[5080,4,5080,6],[5081,4,5081,6],[5082,4,5082,6],[5083,4,5083,6],[5084,4,5084,6],[5085,4,5085,6],[5086,4,5086,6],[5069,4,5069,6],[5070,4,5070,6],[5071,4,5071,6],[5072,4,5072,6],[5073,4,5073,6],[5074,4,5074,6],[5075,4,5075,6],[5076,4,5076,6],[5077,4,5077,6],[5060,4,5060,6],[5061,4,5061,6],[5062,4,5062,6],[5063,4,5063,6],[5064,4,5064,6],[5065,4,5065,6],[5066,4,5066,6],[5067,4,5067,6],[5068,4,5068,6],[5051,4,5051,6],[5052,4,5052,6],[5053,4,5053,6],[5054,4,5054,6],[5055,4,5055,6],[5056,4,5056,6],[5057,4,5057,6],[5058,4,5058,6],[5059,4,5059,6],[5042,4,5042,6],[5043,4,5043,6],[5044,4,5044,6],[5045,4,5045,6],[5046,4,5046,6],[5047,4,5047,6],[5048,4,5048,6],[5049,4,5049,6],[5050,4,5050,6],[5033,4,5033,6],[5034,4,5034,6],[5035,4,5035,6],[5036,4,5036,6],[5037,4,5037,6],[5038,4,5038,6],[5039,4,5039,6],[5040,4,5040,6],[5041,4,5041,6],[5024,4,5024,6],[5025,4,5025,6],[5026,4,5026,6],[5027,4,5027,6],[5028,4,5028,6],[5029,4,5029,6],[5030,4,5030,6],[5031,4,5031,6],[5032,4,5032,6],[5015,4,5015,6],[5016,4,5016,6],[5017,4,5017,6],[5018,4,5018,6],[5019,4,5019,6],[5020,4,5020,6],[5021,4,5021,6],[5022,4,5022,6],[5023,4,5023,6],[5006,4,5006,6],[5007,4,5007,6],[5008,4,5008,6],[5009,4,5009,6],[5010,4,5010,6],[5011,4,5011,6],[5012,4,5012,6],[5013,4,5013,6],[5014,4,5014,6],[4997,4,4997,6],[4998,4,4998,6],[4999,4,4999,6],[5000,4,5000,6],[5001,4,5001,6],[5002,4,5002,6],[5003,4,5003,6],[5004,4,5004,6],[5005,4,5005,6],[4988,4,4988,6],[4989,4,4989,6],[4990,4,4990,6],[4991,4,4991,6],[4992,4,4992,6],[4993,4,4993,6],[4994,4,4994,6],[4995,4,4995,6],[4996,4,4996,6],[4979,4,4979,6],[4980,4,4980,6],[4981,4,4981,6],[4982,4,4982,6],[4983,4,4983,6],[4984,4,4984,6],[4985,4,4985,6],[4986,4,4986,6],[4987,4,4987,6],[4970,4,4970,6],[4971,4,4971,6],[4972,4,4972,6],[4973,4,4973,6],[4974,4,4974,6],[4975,4,4975,6],[4976,4,4976,6],[4977,4,4977,6],[4978,4,4978,6],[4961,4,4961,6],[4962,4,4962,6],[4963,4,4963,6],[4964,4,4964,6],[4965,4,4965,6],[4966,4,4966,6],[4967,4,4967,6],[4968,4,4968,6],[4969,4,4969,6],[4952,4,4952,6],[4953,4,4953,6],[4954,4,4954,6],[4955,4,4955,6],[4956,4,4956,6],[4957,4,4957,6],[4958,4,4958,6],[4959,4,4959,6],[4960,4,4960,6],[4943,4,4943,6],[4944,4,4944,6],[4945,4,4945,6],[4946,4,4946,6],[4947,4,4947,6],[4948,4,4948,6],[4949,4,4949,6],[4950,4,4950,6],[4951,4,4951,6],[4934,4,4934,6],[4935,4,4935,6],[4936,4,4936,6],[4937,4,4937,6],[4938,4,4938,6],[4939,4,4939,6],[4940,4,4940,6],[4941,4,4941,6],[4942,4,4942,6],[4925,4,4925,6],[4926,4,4926,6],[4927,4,4927,6],[4928,4,4928,6],[4929,4,4929,6],[4930,4,4930,6],[4931,4,4931,6],[4932,4,4932,6],[4933,4,4933,6],[4916,4,4916,6],[4917,4,4917,6],[4918,4,4918,6],[4919,4,4919,6],[4920,4,4920,6],[4921,4,4921,6],[4922,4,4922,6],[4923,4,4923,6],[4924,4,4924,6],[4907,4,4907,6],[4908,4,4908,6],[4909,4,4909,6],[4910,4,4910,6],[4911,4,4911,6],[4912,4,4912,6],[4913,4,4913,6],[4914,4,4914,6],[4915,4,4915,6],[255,4,255,6],[256,4,256,6],[257,4,257,6],[258,4,258,6],[259,4,259,6],[4898,4,4898,6],[4899,4,4899,6],[4900,4,4900,6],[4901,4,4901,6],[4902,4,4902,6],[4903,4,4903,6],[4904,4,4904,6],[4905,4,4905,6],[4906,4,4906,6],[4889,4,4889,6],[4890,4,4890,6],[4891,4,4891,6],[4892,4,4892,6],[4893,4,4893,6],[4894,4,4894,6],[4895,4,4895,6],[4896,4,4896,6],[4897,4,4897,6],[4811,4,4811,6],[4812,4,4812,6],[4813,4,4813,6],[4814,4,4814,6],[4815,4,4815,6],[4816,4,4816,6],[4817,4,4817,6],[4818,4,4818,6],[4819,4,4819,6],[244,4,244,6],[245,4,245,6],[246,4,246,6],[242,4,242,6],[243,4,243,6],[4881,4,4881,6],[4882,4,4882,6],[4883,4,4883,6],[4884,4,4884,6],[4885,4,4885,6],[4886,4,4886,6],[4887,4,4887,6],[4888,4,4888,6],[252,4,252,6],[4871,4,4871,6],[4872,4,4872,6],[4873,4,4873,6],[4874,4,4874,6],[4875,4,4875,6],[4876,4,4876,6],[4877,4,4877,6],[4878,4,4878,6],[4879,4,4879,6],[264,4,264,6],[265,4,265,6],[266,4,266,6],[267,4,267,6],[268,4,268,6],[269,4,269,6],[4870,4,4870,6],[253,4,253,6],[254,4,254,6],[174,4,174,6],[4880,4,4880,6],[4770,4,4770,6],[4771,4,4771,6],[4772,4,4772,6],[4773,4,4773,6],[4774,4,4774,6],[4775,4,4775,6],[4776,4,4776,6],[4777,4,4777,6],[4778,4,4778,6],[4779,4,4779,6],[4780,4,4780,6],[4781,4,4781,6],[4782,4,4782,6],[4783,4,4783,6],[4784,4,4784,6],[247,4,247,6],[248,4,248,6],[260,4,260,6],[261,4,261,6],[4785,4,4785,6],[4786,4,4786,6],[4787,4,4787,6],[4788,4,4788,6],[4789,4,4789,6],[4790,4,4790,6],[262,4,262,6],[263,4,263,6],[226,4,226,6],[227,4,227,6],[228,4,228,6],[121,8,123,8],[187,4,187,6],[195,4,195,6],[186,4,186,6],[176,4,176,6],[178,4,178,6],[179,4,179,6],[177,4,177,6],[180,4,180,6],[172,4,172,6],[173,4,173,6],[144,3,144,4],[124,6,128,6],[170,4,170,6],[196,4,196,6],[14,9,19,9],[56,9,57,9],[62,7,63,7],[74,6,75,6],[69,7,71,7],[66,8,103,8],[76,6,78,6],[82,6,84,6],[72,7,73,7],[92,7,93,7],[76,7,78,7],[30,9,36,9],[62,6,63,6],[62,9,63,9],[58,7,61,7],[58,8,61,8],[145,3,145,4],[5195,9,5196,9],[129,9,130,9],[5187,9,5188,9],[5189,9,5190,9],[124,8,128,8],[5195,8,5196,8],[124,7,128,7],[129,8,130,8],[169,4,169,6],[5191,8,5192,8],[133,2,133,8],[5189,7,5190,7],[5189,8,5190,8],[5187,8,5188,8],[143,3,143,4],[5191,9,5192,9],[185,4,185,6],[250,4,250,6],[251,4,251,6],[132,2,132,8],[225,4,225,6],[224,4,224,6],[146,3,146,4],[147,3,147,4],[148,3,148,4],[158,9,159,9],[197,4,197,6],[201,4,201,6],[202,4,202,6],[235,4,235,6],[236,4,236,6]],"merged_total":1122,"flags":["merged_cut"]}
[{"$f":"IF(ISBLANK('Form 1 Main'!G14),\"\",\"Financial return of\")&\" \"&IF(ISBLANK('Form 1 Main'!G14),\"\",'Form 1 Main'!G14)&\" as of the end of reporting month \"&IF(ISBLANK('Form 1 Main'!L21),\"\",'Form 1 Main'!L21)","v":"Financial return of  as of the end of reporting month "},null,null,null,null,null,null,null,null,{"$f":"IF(ISBLANK(Config!C7),\"\",Config!C7)","v":""}]
[]
[]
[null,null,null,null,null,null,null,"Amounts included in"]
[null,"Item","Liabilities",null,"section ref.\n(Note 3)",null,null,"Liquid capital computation","Balance sheet"]
[null,null,null,null,null,null,null,"(HK$'000)","(HK$'000)"]
[null,"22","Short positions in securities and",null,"43(1)",null,"[1055]",0,0,"[1056]"]
[null,null,null,"investments held for own account"]
[]
[]
[null,"23","Amounts payable to clients",null,"37 & 38",null,"[1057]",0,0,"[1058]"]
[]
[]
[]
[null,"24","Amounts payable to",null,"39(2)",null,"[1059]",0,0,"[1060]"]
[null,null,null,"securities dealers arising from provision of"]
[null,null,null,"securities margin financing to common clients"]
[]
[]
[]
[null,"25","Amounts payable to clearing houses",null,"37"]
[null,null,null,"- HKSCC",null,null,"[1061]",0,0,"[1062]"]
[null,null,null,"- SEOCH",null,null,"[1063]",0,0,"[1064]"]
[null,null,null,"- HKFECC",null,null,"[1065]",0,0,"[1066]"]
[null,null,null,"- Euroclear Bank S.A./N.V.,\n  Euroclear France S.A.,\n  Clearstream Banking S.A.,\n  Clearstream Banking AG or \n  Korea Securities Finance Corporation",null,null,"[1067]",0,0,"[1068]"]
[null,null,null,"- other clearing houses",null,null,null,0,0]
[null,null,null,null,null,null,"[1069]",null,null,"[1070]"]
[]
[]
[]
[null,"26","Amounts payable to",null,"37 & 39(1)",null,"[1071]",0,0,"[1072]"]
[null,null,null,"licensed corporations licensed for"]
[null,null,null,"securities margin financing and"]
[null,null,null,"other securities dealers "]
[null,null,null,"in respect of dealing in securities"]
[]
[]
[null,"27","Amounts payable to",null,"37",null,null,0,0]
[null,null,null,"other dealers and clearing participants"]
[null,null,null,"in respect of dealing in "]
[null,null,null,"futures and unlisted options contracts"]
[]
[null,null,null,null,null,null,"[1073]",null,null,"[1074]"]
[null,"28","Other payables and liabilities",null,"45(4), 46(3), 53(1)(a) - (e) & (h)"]
[null,null,null,"- loans and overdrafts from\n  authorized financial institutions",null,null,"[1075]",0,0,"[1076]"]
[null,null,null,"- loans and overdrafts from other \n  financial institutions",null,null,"[1077]",0,0,"[1078]"]
[null,null,null,"- amounts payable to group",null,null,"[1079]",0,0,"[1080]"]
[null,null,null,"  companies or other related parties"]
[]
[]
[null,null,null,"- amounts payable to licensed providers licensed under AMLO",null,null,"[1080AA]",0,0,"[1080AB]"]
[null,null,null,"- amounts payable to virtual asset trading platforms other than      ",null,null,null,0,0]
[null,null,null,"  licensed providers licensed under AMLO",null,null,"[1080AC]",null,null,"[1080AD]"]
[null,null,null,"- loans from other lenders",null,null,"[1080AE]",0,0,"[1080AF]"]
[null,null,null,"- amounts payable to borrowers under securities",null,null,"[1080A]",0,0,"[1080B]"]
[null,null,null,"  borrowing and lending agreements"]
[null,null,null,"- amounts of consideration for securities sold in ",null,null,"[1080C]",0,0,"[1080D]"]
[null,null,null,"  repurchase transactions"]
[null,null,null,"- accruals, amounts payable and",null,null,null,0,0]
[null,null,null,"  other liabilities other than approved "]
[null,null,null,"  subordinated loan"]
[null,null,null,null,null,null,"[1081]",null,null,"[1082]"]
[null,"29","Provisions for contingent liabilities and floating losses ",null,"41(1)(b), 53(1)(f) & (g)",null,"[1083]",0,0,"[1084]"]
[]
[null,"30","Approved subordinated loan",null,"53(2)(a)",null,null,null,0,"[1085]"]
[]
[null,"31","Ranking liabilities relating to"]
[null,null,null,"- gearing adjustment in respect of","42(2)",null,null,0]
[null,null,null,"  securities margin financing",null,null,"[1086]"]
[null,null,null,"- short selling of securities on behalf of clients","43(10)",null,"[1087]",0]
[]
[]
[null,null,null,"- futures & unlisted options contracts (Note 7)","40",null,"[1088]",0]
[]
[null,null,null,"- concentration of margin clients","42(1)",null,"[1089]",0]
[]
[null,null,null,"- increase in amounts in respect of short positions","43(2) - (9)",null,"[1090]",0]
[null,null,null,"  held for own account"]
[]
[null,null,null,"- concentrated proprietary positions","44",null,"[1091]",0]
[null,null,null,"- securities borrowing and lending","45(1) - (3) & (5) - (6), 46(1) & (2)",null,null,0]
[null,null,null,"  and repurchase transactions",null,null,"[1092]"]
[null,null,null,"- introduction of transactions to","51",null,"[1093]",0]
[null,null,null,"  another person for execution or clearing"]
[]
[null,null,null,"- net underwriting commitments","47",null,"[1094]",0]
[]
[]
[null,null,null,"- off-exchange traded derivative","48 & 49",null,"[1095]",0]
[null,null,null,"  contracts and interest rate"]
[null,null,null,"  swap agreements"]
[]
[null,null,null,"- guarantees and other financial commitments","52(1)(a)",null,"[1096]",0]
[]
[null,null,null,"- foreign exchange agreements and","50 & 51A",null,"[1097]",0]
[null,null,null,"  foreign currency positions"]
[]
[null,null,null,"- insufficient margin received","41(1)(a) & 41(2)",null,"[1098]",0]
[null,null,null,"  for leveraged foreign exchange trading"]
[]
[]
[]
[null,null,null,"- miscellaneous ranking liabilities","52(1)(b), (d) & (e)",null,"[1099]",0]
[]
[null,"32","Total liabilities (aggregate of amounts in items 22 to 30)",null,null,null,null,null,{"$f":"SUM(I7:I66)","v":0},"[1100]"]
[]
[]
[]
[]
[null,"33","Redeemable shares (other than",null,"52(1)(c)",null,"[1101]",0]
[null,null,null,"approved redeemable shares)"]
[null,"34","Total ranking liabilities (aggregate of",null,null,null,"[1102]",{"$f":"SUM(H7:H111)","v":0}]
[null,null,null,"amounts in items 22 to 29, 31 & 33)"]
[]
[]
[]
[]
[null,"35","Liquid capital (amount in item 19",null,null,null,"[1103]",{"$f":"'Form 1 Assets'!H98-H112","v":0}]
[null,null,null," less amount in item 34)"]
[]
[]
[null,"36","Required liquid capital",null,"2",null,"[1104]",{"$f":"'Form 2'!M59","v":0}]
[]
[]
[null,"37","Excess liquid capital/(Required liquid capital deficit)",null,null,null,"[1105]",{"$f":"H118-H122","v":0}]
[null,null,null,"(amount in item 35 less amount in item 36)"]
[]
[]
[]
[null,"38","Shareholders' funds (amount in item 21 less",null,null,null,null,null,0,"[1106]"]
[null,null,null,"amount in item 32) (Note 8)"]
[]
[null,"Note 3:","Unless specified otherwise, references to sections/subsections in this column are to sections/subsections of the Securities and Futures (Financial Resources) Rules and are made for the purpose of identifying the amounts to be included in the financial return."]
[null,"Note 4:","Amounts of \"bank balances held in other accounts and cash in hand\" included in liquid assets are comprised of: "]
[null,null,null,"Bank balances -",null,null,null,null,"(HK$'000)"]
[null,null,null,"  - Encumbered or pledged",null,null,null,null,0,"[1107]"]
[null,null,null,"  - Unencumbered",null,null,null,null,0,"[1108]"]
[null,null,null,"Cash in hand",null,null,null,null,0,"[1109]"]
[]
[]
[null,null,null,"Amounts included in cell 1009",null,null,null,null,{"$f":"SUM(I136:I138)","v":0},"[1110]"]
[]
[null,null,"Top 5 authorized financial institutions or approved banks incorporated outside Hong Kong holding the largest aggregate amount of money for the licensed corporation in other accounts"]
[null,"Row","Ranking","Name of authorized financial institution or \napproved bank incorporated outside Hong Kong",null,"Geographical location",null,"Is it an affiliate of the licensed corporation?","Amount held in other accounts\n(HK$'000)","Row"]
[null,"[1]",1,"",null,"",null,"",0,"[1]"]
[null,"[2]",2,"",null,"",null,"",0,"[2]"]
[null,"[3]",3,"",null,"",null,"",0,"[3]"]
[null,"[4]",4,"",null,"",null,"",0,"[4]"]
[null,"[5]",5,"",null,"",null,"",0,"[5]"]
[]
[]
[null,"Note 5:","Margin shortfall under section 22(2) is calculated on:",null,null,null,null,null,null,"."]
[null,null,"(select where appropriate)"]
[]
[]
[]
[]
[null,"Note 6:","Analysis of proprietary positions"]
[null,null,"(A) Analysis of proprietary positions in securities and specified investments by product type"]
[null,null,null,null,null,null,null,null,"Market value\n(HK$'000)"]
[null,null,null,"Listed shares (including exchange traded funds (\"ETFs\") and listed real estate investment trusts (\"REITs\") but excluding debt securities)",null,null,null,null,0,"[1111A]"]
[null,null,null,"Debt securities",null,null,null,null,0,"[1111B]"]
[null,null,null,"Investment funds (excluding ETFs and listed REITs)",null,null,null,null,0,"[1111C]"]
[null,null,null,"Others",null,null,null,null,0,"[1111D]"]
[]
[]
[null,null,null,"Amounts included in cell 1022",null,null,null,null,{"$f":"SUM(I161:I164)","v":0},"[1111E]"]
[]
[null,null,"(B) List of individual proprietary position in securities, virtual assets and specified investments with a market value representing over 10% of the excess liquid capital reported in cell 1105 (ranked in descending order of the market value) (please provide up to 50 investments)\nNote: For proprietary positions in virtual assets please input \"VA\" in \"Stock code / sedol no. / ISIN code\" column."]
[null,null,"Ranking","Name of product","Nature of product",null,null,"Stock code / sedol no. / ISIN code","Market Value \n(HK$'000)"]
[null,"[6]",1,"",null,null,null,"",0,"[6]",null," "]
[null,"[7]",2,"",null,null,null,"",0,"[7]"]
[null,"[8]",3,"",null,null,null,"",0,"[8]"]
[null,"[9]",4,"",null,null,null,"",0,"[9]"]
[null,"[10]",5,"",null,null,null,"",0,"[10]"]
[null,"[11]",6,"",null,null,null,"",0,"[11]"]
[null,"[12]",7,"",null,null,null,"",0,"[12]"]
[null,"[13]",8,"",null,null,null,"",0,"[13]"]
[null,"[14]",9,"",null,null,null,"",0,"[14]"]
[null,"[15]",10,"",null,null,null,"",0,"[15]"]
[null,"[16]",11,"",null,null,null,"",0,"[16]"]
[null,"[17]",12,"",null,null,null,"",0,"[17]"]
[null,"[18]",13,"",null,null,null,"",0,"[18]"]
[null,"[19]",14,"",null,null,null,"",0,"[19]"]
[null,"[20]",15,"",null,null,null,"",0,"[20]"]
[null,"[21]",16,"",null,null,null,"",0,"[21]"]
[null,"[22]",17,"",null,null,null,"",0,"[22]"]
[null,"[23]",18,"",null,null,null,"",0,"[23]"]
[null,"[24]",19,"",null,null,null,"",0,"[24]"]
[null,"[25]",20,"",null,null,null,"",0,"[25]"]
[null,"[26]",21,"",null,null,null,"",0,"[26]"]
[null,"[27]",22,"",null,null,null,"",0,"[27]"]
[null,"[28]",23,"",null,null,null,"",0,"[28]"]
[null,"[29]",24,"",null,null,null,"",0,"[29]"]
[null,"[30]",25,"",null,null,null,"",0,"[30]"]
[null,"[31]",26,"",null,null,null,"",0,"[31]"]
[null,"[32]",27,"",null,null,null,"",0,"[32]"]
[null,"[33]",28,"",null,null,null,"",0,"[33]"]
[null,"[34]",29,"",null,null,null,"",0,"[34]"]
[null,"[35]",30,"",null,null,null,"",0,"[35]"]
[null,"[36]",31,"",null,null,null,"",0,"[36]"]
[null,"[37]",32,"",null,null,null,"",0,"[37]"]
[null,"[38]",33,"",null,null,null,"",0,"[38]"]
[null,"[39]",34,"",null,null,null,"",0,"[39]"]
[null,"[40]",35,"",null,null,null,"",0,"[40]"]
[null,"[41]",36,"",null,null,null,"",0,"[41]"]
[null,"[42]",37,"",null,null,null,"",0,"[42]"]
[null,"[43]",38,"",null,null,null,"",0,"[43]"]
[null,"[44]",39,"",null,null,null,"",0,"[44]"]
[null,"[45]",40,"",null,null,null,"",0,"[45]"]
[null,"[46]",41,"",null,null,null,"",0,"[46]"]
[null,"[47]",42,"",null,null,null,"",0,"[47]"]
[null,"[48]",43,"",null,null,null,"",0,"[48]"]
[null,"[49]",44,"",null,null,null,"",0,"[49]"]
[null,"[50]",45,"",null,null,null,"",0,"[50]"]
[null,"[51]",46,"",null,null,null,"",0,"[51]"]
[null,"[52]",47,"",null,null,null,"",0,"[52]"]
[null,"[53]",48,"",null,null,null,"",0,"[53]"]
[null,"[54]",49,"",null,null,null,"",0,"[54]"]
[null,"[55]",50,"",null,null,null,"",0,"[55]"]
[null,null,51,"",null,null,null,"",0]
[null,null,52,"",null,null,null,"",0]
[null,null,53,"",null,null,null,"",0]
[null,null,54,"",null,null,null,"",0]
[null,null,55,"",null,null,null,"",0]
[null,null,56,"",null,null,null,"",0]
[null,null,57,"",null,null,null,"",0]
[null,null,58,"",null,null,null,"",0]
[null,null,59,"",null,null,null,"",0]
[null,null,60,"",null,null,null,"",0]
[null,null,61,"",null,null,null,"",0]
[null,null,62,"",null,null,null,"",0]
[null,null,63,"",null,null,null,"",0]
[null,null,64,"",null,null,null,"",0]
[null,null,65,"",null,null,null,"",0]
[null,null,66,"",null,null,null,"",0]
[null,null,67,"",null,null,null,"",0]
[null,null,68,"",null,null,null,"",0]
[null,null,69,"",null,null,null,"",0]
[null,null,70,"",null,null,null,"",0]
[null,null,71,"",null,null,null,"",0]
[null,null,72,"",null,null,null,"",0]
[null,null,73,"",null,null,null,"",0]
[null,null,74,"",null,null,null,"",0]
[null,null,75,"",null,null,null,"",0]
[null,null,76,"",null,null,null,"",0]
[null,null,77,"",null,null,null,"",0]
[null,null,78,"",null,null,null,"",0]
[null,null,79,"",null,null,null,"",0]
[null,null,80,"",null,null,null,"",0]
[null,null,81,"",null,null,null,"",0]
[null,null,82,"",null,null,null,"",0]
[null,null,83,"",null,null,null,"",0]
[null,null,84,"",null,null,null,"",0]
[null,null,85,"",null,null,null,"",0]
[null,null,86,"",null,null,null,"",0]
[null,null,87,"",null,null,null,"",0]
[null,null,88,"",null,null,null,"",0]
[null,null,89,"",null,null,null,"",0]
[null,null,90,"",null,null,null,"",0]
[null,null,91,"",null,null,null,"",0]
[null,null,92,"",null,null,null,"",0]
[null,null,93,"",null,null,null,"",0]
[null,null,94,"",null,null,null,"",0]
[null,null,95,"",null,null,null,"",0]
[null,null,96,"",null,null,null,"",0]
[null,null,97,"",null,null,null,"",0]
[null,null,98,"",null,null,null,"",0]
[null,null,99,"",null,null,null,"",0]
[null,null,100,"",null,null,null,"",0]
[null,null,101,"",null,null,null,"",0]
[null,null,102,"",null,null,null,"",0]
[null,null,103,"",null,null,null,"",0]
[null,null,104,"",null,null,null,"",0]
[null,null,105,"",null,null,null,"",0]
[null,null,106,"",null,null,null,"",0]
[null,null,107,"",null,null,null,"",0]
[null,null,108,"",null,null,null,"",0]
[null,null,109,"",null,null,null,"",0]
[null,null,110,"",null,null,null,"",0]
[null,null,111,"",null,null,null,"",0]
[null,null,112,"",null,null,null,"",0]
[null,null,113,"",null,null,null,"",0]
[null,null,114,"",null,null,null,"",0]
[null,null,115,"",null,null,null,"",0]
[null,null,116,"",null,null,null,"",0]
[null,null,117,"",null,null,null,"",0]
[null,null,118,"",null,null,null,"",0]
[null,null,119,"",null,null,null,"",0]
[null,null,120,"",null,null,null,"",0]
[null,null,121,"",null,null,null,"",0]
[null,null,122,"",null,null,null,"",0]
[null,null,123,"",null,null,null,"",0]
[null,null,124,"",null,null,null,"",0]
[null,null,125,"",null,null,null,"",0]
[null,null,126,"",null,null,null,"",0]
[null,null,127,"",null,null,null,"",0]
[null,null,128,"",null,null,null,"",0]
[null,null,129,"",null,null,null,"",0]
[null,null,130,"",null,null,null,"",0]
[null,null,131,"",null,null,null,"",0]
[null,null,132,"",null,null,null,"",0]
[null,null,133,"",null,null,null,"",0]
[null,null,134,"",null,null,null,"",0]
[null,null,135,"",null,null,null,"",0]
[null,null,136,"",null,null,null,"",0]
[null,null,137,"",null,null,null,"",0]
[null,null,138,"",null,null,null,"",0]
[null,null,139,"",null,null,null,"",0]
[null,null,140,"",null,null,null,"",0]
[null,null,141,"",null,null,null,"",0]
[null,null,142,"",null,null,null,"",0]
[null,null,143,"",null,null,null,"",0]
[null,null,144,"",null,null,null,"",0]
[null,null,145,"",null,null,null,"",0]
[null,null,146,"",null,null,null,"",0]
[null,null,147,"",null,null,null,"",0]
[null,null,148,"",null,null,null,"",0]
[null,null,149,"",null,null,null,"",0]
[null,null,150,"",null,null,null,"",0]
[null,null,151,"",null,null,null,"",0]
[null,null,152,"",null,null,null,"",0]
[null,null,153,"",null,null,null,"",0]
[null,null,154,"",null,null,null,"",0]
[null,null,155,"",null,null,null,"",0]
[null,null,156,"",null,null,null,"",0]
[null,null,157,"",null,null,null,"",0]
[null,null,158,"",null,null,null,"",0]
[null,null,159,"",null,null,null,"",0]
[null,null,160,"",null,null,null,"",0]
[null,null,161,"",null,null,null,"",0]
[null,null,162,"",null,null,null,"",0]
[null,null,163,"",null,null,null,"",0]
[null,null,164,"",null,null,null,"",0]
[null,null,165,"",null,null,null,"",0]
[null,null,166,"",null,null,null,"",0]
[null,null,167,"",null,null,null,"",0]
[null,null,168,"",null,null,null,"",0]
[null,null,169,"",null,null,null,"",0]
[null,null,170,"",null,null,null,"",0]
[null,null,171,"",null,null,null,"",0]
[null,null,172,"",null,null,null,"",0]
[null,null,173,"",null,null,null,"",0]
[null,null,174,"",null,null,null,"",0]
[null,null,175,"",null,null,null,"",0]
[null,null,176,"",null,null,null,"",0]
[null,null,177,"",null,null,null,"",0]
[null,null,178,"",null,null,null,"",0]
[null,null,179,"",null,null,null,"",0]
[null,null,180,"",null,null,null,"",0]
[null,null,181,"",null,null,null,"",0]
[null,null,182,"",null,null,null,"",0]
[null,null,183,"",null,null,null,"",0]
[null,null,184,"",null,null,null,"",0]
[null,null,185,"",null,null,null,"",0]
[null,null,186,"",null,null,null,"",0]
[null,null,187,"",null,null,null,"",0]
[null,null,188,"",null,null,null,"",0]
[null,null,189,"",null,null,null,"",0]
[null,null,190,"",null,null,null,"",0]
[null,null,191,"",null,null,null,"",0]
[null,null,192,"",null,null,null,"",0]
[null,null,193,"",null,null,null,"",0]
[null,null,194,"",null,null,null,"",0]
[null,null,195,"",null,null,null,"",0]
[null,null,196,"",null,null,null,"",0]
[null,null,197,"",null,null,null,"",0]
[null,null,198,"",null,null,null,"",0]
[null,null,199,"",null,null,null,"",0]
[null,null,200,"",null,null,null,"",0]
[null,null,201,"",null,null,null,"",0]
[null,null,202,"",null,null,null,"",0]
[null,null,203,"",null,null,null,"",0]
[null,null,204,"",null,null,null,"",0]
[null,null,205,"",null,null,null,"",0]
[null,null,206,"",null,null,null,"",0]
[null,null,207,"",null,null,null,"",0]
[null,null,208,"",null,null,null,"",0]
[null,null,209,"",null,null,null,"",0]
[null,null,210,"",null,null,null,"",0]
[null,null,211,"",null,null,null,"",0]
[null,null,212,"",null,null,null,"",0]
[null,null,213,"",null,null,null,"",0]
[null,null,214,"",null,null,null,"",0]
[null,null,215,"",null,null,null,"",0]
[null,null,216,"",null,null,null,"",0]
[null,null,217,"",null,null,null,"",0]
[null,null,218,"",null,null,null,"",0]
[null,null,219,"",null,null,null,"",0]
[null,null,220,"",null,null,null,"",0]
[null,null,221,"",null,null,null,"",0]
[null,null,222,"",null,null,null,"",0]
[null,null,223,"",null,null,null,"",0]
[null,null,224,"",null,null,null,"",0]
[null,null,225,"",null,null,null,"",0]
[null,null,226,"",null,null,null,"",0]
[null,null,227,"",null,null,null,"",0]
[null,null,228,"",null,null,null,"",0]
[null,null,229,"",null,null,null,"",0]
[null,null,230,"",null,null,null,"",0]
[null,null,231,"",null,null,null,"",0]
[null,null,232,"",null,null,null,"",0]
[null,null,233,"",null,null,null,"",0]
[null,null,234,"",null,null,null,"",0]
[null,null,235,"",null,null,null,"",0]
[null,null,236,"",null,null,null,"",0]
[null,null,237,"",null,null,null,"",0]
[null,null,238,"",null,null,null,"",0]
[null,null,239,"",null,null,null,"",0]
[null,null,240,"",null,null,null,"",0]
[null,null,241,"",null,null,null,"",0]
[null,null,242,"",null,null,null,"",0]
[null,null,243,"",null,null,null,"",0]
[null,null,244,"",null,null,null,"",0]
[null,null,245,"",null,null,null,"",0]
[null,null,246,"",null,null,null,"",0]
[null,null,247,"",null,null,null,"",0]
[null,null,248,"",null,null,null,"",0]
[null,null,249,"",null,null,null,"",0]
[null,null,250,"",null,null,null,"",0]
[null,null,251,"",null,null,null,"",0]
[null,null,252,"",null,null,null,"",0]
[null,null,253,"",null,null,null,"",0]
[null,null,254,"",null,null,null,"",0]
[null,null,255,"",null,null,null,"",0]
[null,null,256,"",null,null,null,"",0]
[null,null,257,"",null,null,null,"",0]
[null,null,258,"",null,null,null,"",0]
[null,null,259,"",null,null,null,"",0]
[null,null,260,"",null,null,null,"",0]
[null,null,261,"",null,null,null,"",0]
[null,null,262,"",null,null,null,"",0]
[null,null,263,"",null,null,null,"",0]
[null,null,264,"",null,null,null,"",0]
[null,null,265,"",null,null,null,"",0]
[null,null,266,"",null,null,null,"",0]
[null,null,267,"",null,null,null,"",0]
[null,null,268,"",null,null,null,"",0]
[null,null,269,"",null,null,null,"",0]
[null,null,270,"",null,null,null,"",0]
[null,null,271,"",null,null,null,"",0]
[null,null,272,"",null,null,null,"",0]
[null,null,273,"",null,null,null,"",0]
[null,null,274,"",null,null,null,"",0]
[null,null,275,"",null,null,null,"",0]
[null,null,276,"",null,null,null,"",0]
[null,null,277,"",null,null,null,"",0]
[null,null,278,"",null,null,null,"",0]
[null,null,279,"",null,null,null,"",0]
[null,null,280,"",null,null,null,"",0]
[null,null,281,"",null,null,null,"",0]
[null,null,282,"",null,null,null,"",0]
[null,null,283,"",null,null,null,"",0]
[null,null,284,"",null,null,null,"",0]
[null,null,285,"",null,null,null,"",0]
[null,null,286,"",null,null,null,"",0]
[null,null,287,"",null,null,null,"",0]
[null,null,288,"",null,null,null,"",0]
[null,null,289,"",null,null,null,"",0]
[null,null,290,"",null,null,null,"",0]
[null,null,291,"",null,null,null,"",0]
[null,null,292,"",null,null,null,"",0]
[null,null,293,"",null,null,null,"",0]
[null,null,294,"",null,null,null,"",0]
[null,null,295,"",null,null,null,"",0]
[null,null,296,"",null,null,null,"",0]
[null,null,297,"",null,null,null,"",0]
[null,null,298,"",null,null,null,"",0]
[null,null,299,"",null,null,null,"",0]
[null,null,300,"",null,null,null,"",0]
[null,null,301,"",null,null,null,"",0]
[null,null,302,"",null,null,null,"",0]
[null,null,303,"",null,null,null,"",0]
[null,null,304,"",null,null,null,"",0]
[null,null,305,"",null,null,null,"",0]
[null,null,306,"",null,null,null,"",0]
[null,null,307,"",null,null,null,"",0]
[null,null,308,"",null,null,null,"",0]
[null,null,309,"",null,null,null,"",0]
[null,null,310,"",null,null,null,"",0]
[null,null,311,"",null,null,null,"",0]
[null,null,312,"",null,null,null,"",0]
[null,null,313,"",null,null,null,"",0]
[null,null,314,"",null,null,null,"",0]
[null,null,315,"",null,null,null,"",0]
[null,null,316,"",null,null,null,"",0]
[null,null,317,"",null,null,null,"",0]
[null,null,318,"",null,null,null,"",0]
[null,null,319,"",null,null,null,"",0]
[null,null,320,"",null,null,null,"",0]
[null,null,321,"",null,null,null,"",0]
[null,null,322,"",null,null,null,"",0]
[null,null,323,"",null,null,null,"",0]
[null,null,324,"",null,null,null,"",0]
[null,null,325,"",null,null,null,"",0]
[null,null,326,"",null,null,null,"",0]
[null,null,327,"",null,null,null,"",0]
[null,null,328,"",null,null,null,"",0]
[null,null,329,"",null,null,null,"",0]
[null,null,330,"",null,null,null,"",0]
[null,null,331,"",null,null,null,"",0]
[null,null,332,"",null,null,null,"",0]
[null,null,333,"",null,null,null,"",0]
[null,null,334,"",null,null,null,"",0]
[null,null,335,"",null,null,null,"",0]
[null,null,336,"",null,null,null,"",0]
[null,null,337,"",null,null,null,"",0]
[null,null,338,"",null,null,null,"",0]
[null,null,339,"",null,null,null,"",0]
[null,null,340,"",null,null,null,"",0]
[null,null,341,"",null,null,null,"",0]
[null,null,342,"",null,null,null,"",0]
[null,null,343,"",null,null,null,"",0]
[null,null,344,"",null,null,null,"",0]
[null,null,345,"",null,null,null,"",0]
[null,null,346,"",null,null,null,"",0]
[null,null,347,"",null,null,null,"",0]
[null,null,348,"",null,null,null,"",0]
[null,null,349,"",null,null,null,"",0]
[null,null,350,"",null,null,null,"",0]
[null,null,351,"",null,null,null,"",0]
[null,null,352,"",null,null,null,"",0]
[null,null,353,"",null,null,null,"",0]
[null,null,354,"",null,null,null,"",0]
[null,null,355,"",null,null,null,"",0]
[null,null,356,"",null,null,null,"",0]
[null,null,357,"",null,null,null,"",0]
[null,null,358,"",null,null,null,"",0]
[null,null,359,"",null,null,null,"",0]
[null,null,360,"",null,null,null,"",0]
[null,null,361,"",null,null,null,"",0]
[null,null,362,"",null,null,null,"",0]
[null,null,363,"",null,null,null,"",0]
[null,null,364,"",null,null,null,"",0]
[null,null,365,"",null,null,null,"",0]
[null,null,366,"",null,null,null,"",0]
[null,null,367,"",null,null,null,"",0]
[null,null,368,"",null,null,null,"",0]
[null,null,369,"",null,null,null,"",0]
[null,null,370,"",null,null,null,"",0]
[null,null,371,"",null,null,null,"",0]
[null,null,372,"",null,null,null,"",0]
[null,null,373,"",null,null,null,"",0]
[null,null,374,"",null,null,null,"",0]
[null,null,375,"",null,null,null,"",0]
[null,null,376,"",null,null,null,"",0]
[null,null,377,"",null,null,null,"",0]
[null,null,378,"",null,null,null,"",0]
[null,null,379,"",null,null,null,"",0]
[null,null,380,"",null,null,null,"",0]
[null,null,381,"",null,null,null,"",0]
[null,null,382,"",null,null,null,"",0]
[null,null,383,"",null,null,null,"",0]
[null,null,384,"",null,null,null,"",0]
[null,null,385,"",null,null,null,"",0]
[null,null,386,"",null,null,null,"",0]
[null,null,387,"",null,null,null,"",0]
[null,null,388,"",null,null,null,"",0]
[null,null,389,"",null,null,null,"",0]
[null,null,390,"",null,null,null,"",0]
[null,null,391,"",null,null,null,"",0]
[null,null,392,"",null,null,null,"",0]
[null,null,393,"",null,null,null,"",0]
[null,null,394,"",null,null,null,"",0]
[null,null,395,"",null,null,null,"",0]
[null,null,396,"",null,null,null,"",0]
[null,null,397,"",null,null,null,"",0]
[null,null,398,"",null,null,null,"",0]
[null,null,399,"",null,null,null,"",0]
[null,null,400,"",null,null,null,"",0]
[null,null,401,"",null,null,null,"",0]
[null,null,402,"",null,null,null,"",0]
[null,null,403,"",null,null,null,"",0]
[null,null,404,"",null,null,null,"",0]
[null,null,405,"",null,null,null,"",0]
[null,null,406,"",null,null,null,"",0]
[null,null,407,"",null,null,null,"",0]
[null,null,408,"",null,null,null,"",0]
[null,null,409,"",null,null,null,"",0]
[null,null,410,"",null,null,null,"",0]
[null,null,411,"",null,null,null,"",0]
[null,null,412,"",null,null,null,"",0]
[null,null,413,"",null,null,null,"",0]
[null,null,414,"",null,null,null,"",0]
[null,null,415,"",null,null,null,"",0]
[null,null,416,"",null,null,null,"",0]
[null,null,417,"",null,null,null,"",0]
[null,null,418,"",null,null,null,"",0]
[null,null,419,"",null,null,null,"",0]
[null,null,420,"",null,null,null,"",0]
[null,null,421,"",null,null,null,"",0]
[null,null,422,"",null,null,null,"",0]
[null,null,423,"",null,null,null,"",0]
[null,null,424,"",null,null,null,"",0]
[null,null,425,"",null,null,null,"",0]
[null,null,426,"",null,null,null,"",0]
[null,null,427,"",null,null,null,"",0]
[null,null,428,"",null,null,null,"",0]
[null,null,429,"",null,null,null,"",0]
[null,null,430,"",null,null,null,"",0]
[null,null,431,"",null,null,null,"",0]
[null,null,432,"",null,null,null,"",0]
[null,null,433,"",null,null,null,"",0]
[null,null,434,"",null,null,null,"",0]
[null,null,435,"",null,null,null,"",0]
[null,null,436,"",null,null,null,"",0]
[null,null,437,"",null,null,null,"",0]
[null,null,438,"",null,null,null,"",0]
[null,null,439,"",null,null,null,"",0]
[null,null,440,"",null,null,null,"",0]
[null,null,441,"",null,null,null,"",0]
[null,null,442,"",null,null,null,"",0]
[null,null,443,"",null,null,null,"",0]
[null,null,444,"",null,null,null,"",0]
[null,null,445,"",null,null,null,"",0]
[null,null,446,"",null,null,null,"",0]
[null,null,447,"",null,null,null,"",0]
[null,null,448,"",null,null,null,"",0]
[null,null,449,"",null,null,null,"",0]
[null,null,450,"",null,null,null,"",0]
[null,null,451,"",null,null,null,"",0]
[null,null,452,"",null,null,null,"",0]
[null,null,453,"",null,null,null,"",0]
[null,null,454,"",null,null,null,"",0]
[null,null,455,"",null,null,null,"",0]
[null,null,456,"",null,null,null,"",0]
[null,null,457,"",null,null,null,"",0]
[null,null,458,"",null,null,null,"",0]
[null,null,459,"",null,null,null,"",0]
[null,null,460,"",null,null,null,"",0]
[null,null,461,"",null,null,null,"",0]
[null,null,462,"",null,null,null,"",0]
[null,null,463,"",null,null,null,"",0]
[null,null,464,"",null,null,null,"",0]
[null,null,465,"",null,null,null,"",0]
[null,null,466,"",null,null,null,"",0]
[null,null,467,"",null,null,null,"",0]
[null,null,468,"",null,null,null,"",0]
[null,null,469,"",null,null,null,"",0]
[null,null,470,"",null,null,null,"",0]
[null,null,471,"",null,null,null,"",0]
[null,null,472,"",null,null,null,"",0]
[null,null,473,"",null,null,null,"",0]
[null,null,474,"",null,null,null,"",0]
[null,null,475,"",null,null,null,"",0]
[null,null,476,"",null,null,null,"",0]
[null,null,477,"",null,null,null,"",0]
[null,null,478,"",null,null,null,"",0]
[null,null,479,"",null,null,null,"",0]
[null,null,480,"",null,null,null,"",0]
[null,null,481,"",null,null,null,"",0]
[null,null,482,"",null,null,null,"",0]
[null,null,483,"",null,null,null,"",0]
[null,null,484,"",null,null,null,"",0]
[null,null,485,"",null,null,null,"",0]
[null,null,486,"",null,null,null,"",0]
[null,null,487,"",null,null,null,"",0]
[null,null,488,"",null,null,null,"",0]
[null,null,489,"",null,null,null,"",0]
[null,null,490,"",null,null,null,"",0]
[null,null,491,"",null,null,null,"",0]
[null,null,492,"",null,null,null,"",0]
[null,null,493,"",null,null,null,"",0]
[null,null,494,"",null,null,null,"",0]
[null,null,495,"",null,null,null,"",0]
[null,null,496,"",null,null,null,"",0]
[null,null,497,"",null,null,null,"",0]
[null,null,498,"",null,null,null,"",0]
[null,null,499,"",null,null,null,"",0]
[null,null,500,"",null,null,null,"",0]
[null,null,501,"",null,null,null,"",0]
[null,null,502,"",null,null,null,"",0]
[null,null,503,"",null,null,null,"",0]
[null,null,504,"",null,null,null,"",0]
[null,null,505,"",null,null,null,"",0]
[null,null,506,"",null,null,null,"",0]
[null,null,507,"",null,null,null,"",0]
[null,null,508,"",null,null,null,"",0]
[null,null,509,"",null,null,null,"",0]
[null,null,510,"",null,null,null,"",0]
[null,null,511,"",null,null,null,"",0]
[null,null,512,"",null,null,null,"",0]
[null,null,513,"",null,null,null,"",0]
[null,null,514,"",null,null,null,"",0]
[null,null,515,"",null,null,null,"",0]
[null,null,516,"",null,null,null,"",0]
[null,null,517,"",null,null,null,"",0]
[null,null,518,"",null,null,null,"",0]
[null,null,519,"",null,null,null,"",0]
[null,null,520,"",null,null,null,"",0]
[null,null,521,"",null,null,null,"",0]
[null,null,522,"",null,null,null,"",0]
[null,null,523,"",null,null,null,"",0]
[null,null,524,"",null,null,null,"",0]
[null,null,525,"",null,null,null,"",0]
[null,null,526,"",null,null,null,"",0]
[null,null,527,"",null,null,null,"",0]
[null,null,528,"",null,null,null,"",0]
[null,null,529,"",null,null,null,"",0]
[null,null,530,"",null,null,null,"",0]
[null,null,531,"",null,null,null,"",0]
[null,null,532,"",null,null,null,"",0]
[null,null,533,"",null,null,null,"",0]
[null,null,534,"",null,null,null,"",0]
[null,null,535,"",null,null,null,"",0]
[null,null,536,"",null,null,null,"",0]
[null,null,537,"",null,null,null,"",0]
[null,null,538,"",null,null,null,"",0]
[null,null,539,"",null,null,null,"",0]
[null,null,540,"",null,null,null,"",0]
[null,null,541,"",null,null,null,"",0]
[null,null,542,"",null,null,null,"",0]
[null,null,543,"",null,null,null,"",0]
[null,null,544,"",null,null,null,"",0]
[null,null,545,"",null,null,null,"",0]
[null,null,546,"",null,null,null,"",0]
[null,null,547,"",null,null,null,"",0]
[null,null,548,"",null,null,null,"",0]
[null,null,549,"",null,null,null,"",0]
[null,null,550,"",null,null,null,"",0]
[null,null,551,"",null,null,null,"",0]
[null,null,552,"",null,null,null,"",0]
[null,null,553,"",null,null,null,"",0]
[null,null,554,"",null,null,null,"",0]
[null,null,555,"",null,null,null,"",0]
[null,null,556,"",null,null,null,"",0]
[null,null,557,"",null,null,null,"",0]
[null,null,558,"",null,null,null,"",0]
[null,null,559,"",null,null,null,"",0]
[null,null,560,"",null,null,null,"",0]
[null,null,561,"",null,null,null,"",0]
[null,null,562,"",null,null,null,"",0]
[null,null,563,"",null,null,null,"",0]
[null,null,564,"",null,null,null,"",0]
[null,null,565,"",null,null,null,"",0]
[null,null,566,"",null,null,null,"",0]
[null,null,567,"",null,null,null,"",0]
[null,null,568,"",null,null,null,"",0]
[null,null,569,"",null,null,null,"",0]
[null,null,570,"",null,null,null,"",0]
[null,null,571,"",null,null,null,"",0]
[null,null,572,"",null,null,null,"",0]
[null,null,573,"",null,null,null,"",0]
[null,null,574,"",null,null,null,"",0]
[null,null,575,"",null,null,null,"",0]
[null,null,576,"",null,null,null,"",0]
[null,null,577,"",null,null,null,"",0]
[null,null,578,"",null,null,null,"",0]
[null,null,579,"",null,null,null,"",0]
[null,null,580,"",null,null,null,"",0]
[null,null,581,"",null,null,null,"",0]
[null,null,582,"",null,null,null,"",0]
[null,null,583,"",null,null,null,"",0]
[null,null,584,"",null,null,null,"",0]
[null,null,585,"",null,null,null,"",0]
[null,null,586,"",null,null,null,"",0]
[null,null,587,"",null,null,null,"",0]
[null,null,588,"",null,null,null,"",0]
[null,null,589,"",null,null,null,"",0]
[null,null,590,"",null,null,null,"",0]
[null,null,591,"",null,null,null,"",0]
[null,null,592,"",null,null,null,"",0]
[null,null,593,"",null,null,null,"",0]
[null,null,594,"",null,null,null,"",0]
[null,null,595,"",null,null,null,"",0]
[null,null,596,"",null,null,null,"",0]
[null,null,597,"",null,null,null,"",0]
[null,null,598,"",null,null,null,"",0]
[null,null,599,"",null,null,null,"",0]
[null,null,600,"",null,null,null,"",0]
[null,null,601,"",null,null,null,"",0]
[null,null,602,"",null,null,null,"",0]
[null,null,603,"",null,null,null,"",0]
[null,null,604,"",null,null,null,"",0]
[null,null,605,"",null,null,null,"",0]
[null,null,606,"",null,null,null,"",0]
[null,null,607,"",null,null,null,"",0]
[null,null,608,"",null,null,null,"",0]
[null,null,609,"",null,null,null,"",0]
[null,null,610,"",null,null,null,"",0]
[null,null,611,"",null,null,null,"",0]
[null,null,612,"",null,null,null,"",0]
[null,null,613,"",null,null,null,"",0]
[null,null,614,"",null,null,null,"",0]
[null,null,615,"",null,null,null,"",0]
[null,null,616,"",null,null,null,"",0]
[null,null,617,"",null,null,null,"",0]
[null,null,618,"",null,null,null,"",0]
[null,null,619,"",null,null,null,"",0]
[null,null,620,"",null,null,null,"",0]
[null,null,621,"",null,null,null,"",0]
[null,null,622,"",null,null,null,"",0]
[null,null,623,"",null,null,null,"",0]
[null,null,624,"",null,null,null,"",0]
[null,null,625,"",null,null,null,"",0]
[null,null,626,"",null,null,null,"",0]
[null,null,627,"",null,null,null,"",0]
[null,null,628,"",null,null,null,"",0]
[null,null,629,"",null,null,null,"",0]
[null,null,630,"",null,null,null,"",0]
[null,null,631,"",null,null,null,"",0]
[null,null,632,"",null,null,null,"",0]
[null,null,633,"",null,null,null,"",0]
[null,null,634,"",null,null,null,"",0]
[null,null,635,"",null,null,null,"",0]
[null,null,636,"",null,null,null,"",0]
[null,null,637,"",null,null,null,"",0]
[null,null,638,"",null,null,null,"",0]
[null,null,639,"",null,null,null,"",0]
[null,null,640,"",null,null,null,"",0]
[null,null,641,"",null,null,null,"",0]
[null,null,642,"",null,null,null,"",0]
[null,null,643,"",null,null,null,"",0]
[null,null,644,"",null,null,null,"",0]
[null,null,645,"",null,null,null,"",0]
[null,null,646,"",null,null,null,"",0]
[null,null,647,"",null,null,null,"",0]
[null,null,648,"",null,null,null,"",0]
[null,null,649,"",null,null,null,"",0]
[null,null,650,"",null,null,null,"",0]
[null,null,651,"",null,null,null,"",0]
[null,null,652,"",null,null,null,"",0]
[null,null,653,"",null,null,null,"",0]
[null,null,654,"",null,null,null,"",0]
[null,null,655,"",null,null,null,"",0]
[null,null,656,"",null,null,null,"",0]
[null,null,657,"",null,null,null,"",0]
[null,null,658,"",null,null,null,"",0]
[null,null,659,"",null,null,null,"",0]
[null,null,660,"",null,null,null,"",0]
[null,null,661,"",null,null,null,"",0]
[null,null,662,"",null,null,null,"",0]
[null,null,663,"",null,null,null,"",0]
[null,null,664,"",null,null,null,"",0]
[null,null,665,"",null,null,null,"",0]
[null,null,666,"",null,null,null,"",0]
[null,null,667,"",null,null,null,"",0]
[null,null,668,"",null,null,null,"",0]
[null,null,669,"",null,null,null,"",0]
[null,null,670,"",null,null,null,"",0]
[null,null,671,"",null,null,null,"",0]
[null,null,672,"",null,null,null,"",0]
[null,null,673,"",null,null,null,"",0]
[null,null,674,"",null,null,null,"",0]
[null,null,675,"",null,null,null,"",0]
[null,null,676,"",null,null,null,"",0]
[null,null,677,"",null,null,null,"",0]
[null,null,678,"",null,null,null,"",0]
[null,null,679,"",null,null,null,"",0]
[null,null,680,"",null,null,null,"",0]
[null,null,681,"",null,null,null,"",0]
[null,null,682,"",null,null,null,"",0]
[null,null,683,"",null,null,null,"",0]
[null,null,684,"",null,null,null,"",0]
[null,null,685,"",null,null,null,"",0]
[null,null,686,"",null,null,null,"",0]
[null,null,687,"",null,null,null,"",0]
[null,null,688,"",null,null,null,"",0]
[null,null,689,"",null,null,null,"",0]
[null,null,690,"",null,null,null,"",0]
[null,null,691,"",null,null,null,"",0]
[null,null,692,"",null,null,null,"",0]
[null,null,693,"",null,null,null,"",0]
[null,null,694,"",null,null,null,"",0]
[null,null,695,"",null,null,null,"",0]
[null,null,696,"",null,null,null,"",0]
[null,null,697,"",null,null,null,"",0]
[null,null,698,"",null,null,null,"",0]
[null,null,699,"",null,null,null,"",0]
[null,null,700,"",null,null,null,"",0]
[null,null,701,"",null,null,null,"",0]
[null,null,702,"",null,null,null,"",0]
[null,null,703,"",null,null,null,"",0]
[null,null,704,"",null,null,null,"",0]
[null,null,705,"",null,null,null,"",0]
[null,null,706,"",null,null,null,"",0]
[null,null,707,"",null,null,null,"",0]
[null,null,708,"",null,null,null,"",0]
[null,null,709,"",null,null,null,"",0]
[null,null,710,"",null,null,null,"",0]
[null,null,711,"",null,null,null,"",0]
[null,null,712,"",null,null,null,"",0]
[null,null,713,"",null,null,null,"",0]
[null,null,714,"",null,null,null,"",0]
[null,null,715,"",null,null,null,"",0]
[null,null,716,"",null,null,null,"",0]
[null,null,717,"",null,null,null,"",0]
[null,null,718,"",null,null,null,"",0]
[null,null,719,"",null,null,null,"",0]
[null,null,720,"",null,null,null,"",0]
[null,null,721,"",null,null,null,"",0]
[null,null,722,"",null,null,null,"",0]
[null,null,723,"",null,null,null,"",0]
[null,null,724,"",null,null,null,"",0]
[null,null,725,"",null,null,null,"",0]
[null,null,726,"",null,null,null,"",0]
[null,null,727,"",null,null,null,"",0]
[null,null,728,"",null,null,null,"",0]
[null,null,729,"",null,null,null,"",0]
[null,null,730,"",null,null,null,"",0]
[null,null,731,"",null,null,null,"",0]
[null,null,732,"",null,null,null,"",0]
[null,null,733,"",null,null,null,"",0]
[null,null,734,"",null,null,null,"",0]
[null,null,735,"",null,null,null,"",0]
[null,null,736,"",null,null,null,"",0]
[null,null,737,"",null,null,null,"",0]
[null,null,738,"",null,null,null,"",0]
[null,null,739,"",null,null,null,"",0]
[null,null,740,"",null,null,null,"",0]
[null,null,741,"",null,null,null,"",0]
[null,null,742,"",null,null,null,"",0]
[null,null,743,"",null,null,null,"",0]
[null,null,744,"",null,null,null,"",0]
[null,null,745,"",null,null,null,"",0]
[null,null,746,"",null,null,null,"",0]
[null,null,747,"",null,null,null,"",0]
[null,null,748,"",null,null,null,"",0]
[null,null,749,"",null,null,null,"",0]
[null,null,750,"",null,null,null,"",0]
[null,null,751,"",null,null,null,"",0]
[null,null,752,"",null,null,null,"",0]
[null,null,753,"",null,null,null,"",0]
[null,null,754,"",null,null,null,"",0]
[null,null,755,"",null,null,null,"",0]
[null,null,756,"",null,null,null,"",0]
[null,null,757,"",null,null,null,"",0]
[null,null,758,"",null,null,null,"",0]
[null,null,759,"",null,null,null,"",0]
[null,null,760,"",null,null,null,"",0]
[null,null,761,"",null,null,null,"",0]
[null,null,762,"",null,null,null,"",0]
[null,null,763,"",null,null,null,"",0]
[null,null,764,"",null,null,null,"",0]
[null,null,765,"",null,null,null,"",0]
[null,null,766,"",null,null,null,"",0]
[null,null,767,"",null,null,null,"",0]
[null,null,768,"",null,null,null,"",0]
[null,null,769,"",null,null,null,"",0]
[null,null,770,"",null,null,null,"",0]
[null,null,771,"",null,null,null,"",0]
[null,null,772,"",null,null,null,"",0]
[null,null,773,"",null,null,null,"",0]
[null,null,774,"",null,null,null,"",0]
[null,null,775,"",null,null,null,"",0]
[null,null,776,"",null,null,null,"",0]
[null,null,777,"",null,null,null,"",0]
[null,null,778,"",null,null,null,"",0]
[null,null,779,"",null,null,null,"",0]
[null,null,780,"",null,null,null,"",0]
[null,null,781,"",null,null,null,"",0]
[null,null,782,"",null,null,null,"",0]
[null,null,783,"",null,null,null,"",0]
[null,null,784,"",null,null,null,"",0]
[null,null,785,"",null,null,null,"",0]
[null,null,786,"",null,null,null,"",0]
[null,null,787,"",null,null,null,"",0]
[null,null,788,"",null,null,null,"",0]
[null,null,789,"",null,null,null,"",0]
[null,null,790,"",null,null,null,"",0]
[null,null,791,"",null,null,null,"",0]
[null,null,792,"",null,null,null,"",0]
[null,null,793,"",null,null,null,"",0]
[null,null,794,"",null,null,null,"",0]
[null,null,795,"",null,null,null,"",0]
[null,null,796,"",null,null,null,"",0]
[null,null,797,"",null,null,null,"",0]
[null,null,798,"",null,null,null,"",0]
[null,null,799,"",null,null,null,"",0]
[null,null,800,"",null,null,null,"",0]
[null,null,801,"",null,null,null,"",0]
[null,null,802,"",null,null,null,"",0]
[null,null,803,"",null,null,null,"",0]
[null,null,804,"",null,null,null,"",0]
[null,null,805,"",null,null,null,"",0]
[null,null,806,"",null,null,null,"",0]
[null,null,807,"",null,null,null,"",0]
[null,null,808,"",null,null,null,"",0]
[null,null,809,"",null,null,null,"",0]
[null,null,810,"",null,null,null,"",0]
[null,null,811,"",null,null,null,"",0]
[null,null,812,"",null,null,null,"",0]
[null,null,813,"",null,null,null,"",0]
[null,null,814,"",null,null,null,"",0]
[null,null,815,"",null,null,null,"",0]
[null,null,816,"",null,null,null,"",0]
[null,null,817,"",null,null,null,"",0]
[null,null,818,"",null,null,null,"",0]
[null,null,819,"",null,null,null,"",0]
[null,null,820,"",null,null,null,"",0]
[null,null,821,"",null,null,null,"",0]
[null,null,822,"",null,null,null,"",0]
[null,null,823,"",null,null,null,"",0]
[null,null,824,"",null,null,null,"",0]
[null,null,825,"",null,null,null,"",0]
[null,null,826,"",null,null,null,"",0]
[null,null,827,"",null,null,null,"",0]
[null,null,828,"",null,null,null,"",0]
[null,null,829,"",null,null,null,"",0]
[null,null,830,"",null,null,null,"",0]
[null,null,831,"",null,null,null,"",0]
[null,null,832,"",null,null,null,"",0]
[null,null,833,"",null,null,null,"",0]
[null,null,834,"",null,null,null,"",0]
[null,null,835,"",null,null,null,"",0]
[null,null,836,"",null,null,null,"",0]
[null,null,837,"",null,null,null,"",0]
[null,null,838,"",null,null,null,"",0]
[null,null,839,"",null,null,null,"",0]
[null,null,840,"",null,null,null,"",0]
[null,null,841,"",null,null,null,"",0]
[null,null,842,"",null,null,null,"",0]
[null,null,843,"",null,null,null,"",0]
[null,null,844,"",null,null,null,"",0]
[null,null,845,"",null,null,null,"",0]
[null,null,846,"",null,null,null,"",0]
[null,null,847,"",null,null,null,"",0]
[null,null,848,"",null,null,null,"",0]
[null,null,849,"",null,null,null,"",0]
[null,null,850,"",null,null,null,"",0]
[null,null,851,"",null,null,null,"",0]
[null,null,852,"",null,null,null,"",0]
[null,null,853,"",null,null,null,"",0]
[null,null,854,"",null,null,null,"",0]
[null,null,855,"",null,null,null,"",0]
[null,null,856,"",null,null,null,"",0]
[null,null,857,"",null,null,null,"",0]
[null,null,858,"",null,null,null,"",0]
[null,null,859,"",null,null,null,"",0]
[null,null,860,"",null,null,null,"",0]
[null,null,861,"",null,null,null,"",0]
[null,null,862,"",null,null,null,"",0]
[null,null,863,"",null,null,null,"",0]
[null,null,864,"",null,null,null,"",0]
[null,null,865,"",null,null,null,"",0]
[null,null,866,"",null,null,null,"",0]
[null,null,867,"",null,null,null,"",0]
[null,null,868,"",null,null,null,"",0]
[null,null,869,"",null,null,null,"",0]
[null,null,870,"",null,null,null,"",0]
[null,null,871,"",null,null,null,"",0]
[null,null,872,"",null,null,null,"",0]
[null,null,873,"",null,null,null,"",0]
[null,null,874,"",null,null,null,"",0]
[null,null,875,"",null,null,null,"",0]
[null,null,876,"",null,null,null,"",0]
[null,null,877,"",null,null,null,"",0]
[null,null,878,"",null,null,null,"",0]
[null,null,879,"",null,null,null,"",0]
[null,null,880,"",null,null,null,"",0]
[null,null,881,"",null,null,null,"",0]
[null,null,882,"",null,null,null,"",0]
[null,null,883,"",null,null,null,"",0]
[null,null,884,"",null,null,null,"",0]
[null,null,885,"",null,null,null,"",0]
[null,null,886,"",null,null,null,"",0]
[null,null,887,"",null,null,null,"",0]
[null,null,888,"",null,null,null,"",0]
[null,null,889,"",null,null,null,"",0]
[null,null,890,"",null,null,null,"",0]
[null,null,891,"",null,null,null,"",0]
[null,null,892,"",null,null,null,"",0]
[null,null,893,"",null,null,null,"",0]
[null,null,894,"",null,null,null,"",0]
[null,null,895,"",null,null,null,"",0]
[null,null,896,"",null,null,null,"",0]
[null,null,897,"",null,null,null,"",0]
[null,null,898,"",null,null,null,"",0]
[null,null,899,"",null,null,null,"",0]
[null,null,900,"",null,null,null,"",0]
[null,null,901,"",null,null,null,"",0]
[null,null,902,"",null,null,null,"",0]
[null,null,903,"",null,null,null,"",0]
[null,null,904,"",null,null,null,"",0]
[null,null,905,"",null,null,null,"",0]
[null,null,906,"",null,null,null,"",0]
[null,null,907,"",null,null,null,"",0]
[null,null,908,"",null,null,null,"",0]
[null,null,909,"",null,null,null,"",0]
[null,null,910,"",null,null,null,"",0]
[null,null,911,"",null,null,null,"",0]
[null,null,912,"",null,null,null,"",0]
[null,null,913,"",null,null,null,"",0]
[null,null,914,"",null,null,null,"",0]
[null,null,915,"",null,null,null,"",0]
[null,null,916,"",null,null,null,"",0]
[null,null,917,"",null,null,null,"",0]
[null,null,918,"",null,null,null,"",0]
[null,null,919,"",null,null,null,"",0]
[null,null,920,"",null,null,null,"",0]
[null,null,921,"",null,null,null,"",0]
[null,null,922,"",null,null,null,"",0]
[null,null,923,"",null,null,null,"",0]
[null,null,924,"",null,null,null,"",0]
[null,null,925,"",null,null,null,"",0]
[null,null,926,"",null,null,null,"",0]
[null,null,927,"",null,null,null,"",0]
[null,null,928,"",null,null,null,"",0]
[null,null,929,"",null,null,null,"",0]
[null,null,930,"",null,null,null,"",0]
[null,null,931,"",null,null,null,"",0]
[null,null,932,"",null,null,null,"",0]
[null,null,933,"",null,null,null,"",0]
[null,null,934,"",null,null,null,"",0]
[null,null,935,"",null,null,null,"",0]
[null,null,936,"",null,null,null,"",0]
[null,null,937,"",null,null,null,"",0]
[null,null,938,"",null,null,null,"",0]
[null,null,939,"",null,null,null,"",0]
[null,null,940,"",null,null,null,"",0]
[null,null,941,"",null,null,null,"",0]
[null,null,942,"",null,null,null,"",0]
[null,null,943,"",null,null,null,"",0]
[null,null,944,"",null,null,null,"",0]
[null,null,945,"",null,null,null,"",0]
[null,null,946,"",null,null,null,"",0]
[null,null,947,"",null,null,null,"",0]
[null,null,948,"",null,null,null,"",0]
[null,null,949,"",null,null,null,"",0]
[null,null,950,"",null,null,null,"",0]
[null,null,951,"",null,null,null,"",0]
[null,null,952,"",null,null,null,"",0]
[null,null,953,"",null,null,null,"",0]
[null,null,954,"",null,null,null,"",0]
[null,null,955,"",null,null,null,"",0]
[null,null,956,"",null,null,null,"",0]
[null,null,957,"",null,null,null,"",0]
[null,null,958,"",null,null,null,"",0]
[null,null,959,"",null,null,null,"",0]
[null,null,960,"",null,null,null,"",0]
[null,null,961,"",null,null,null,"",0]
[null,null,962,"",null,null,null,"",0]
[null,null,963,"",null,null,null,"",0]
[null,null,964,"",null,null,null,"",0]
[null,null,965,"",null,null,null,"",0]
[null,null,966,"",null,null,null,"",0]
[null,null,967,"",null,null,null,"",0]
[null,null,968,"",null,null,null,"",0]
[null,null,969,"",null,null,null,"",0]
[null,null,970,"",null,null,null,"",0]
[null,null,971,"",null,null,null,"",0]
[null,null,972,"",null,null,null,"",0]
[null,null,973,"",null,null,null,"",0]
[null,null,974,"",null,null,null,"",0]
[null,null,975,"",null,null,null,"",0]
[null,null,976,"",null,null,null,"",0]
[null,null,977,"",null,null,null,"",0]
[null,null,978,"",null,null,null,"",0]
[null,null,979,"",null,null,null,"",0]
[null,null,980,"",null,null,null,"",0]
[null,null,981,"",null,null,null,"",0]
[null,null,982,"",null,null,null,"",0]
[null,null,983,"",null,null,null,"",0]
[null,null,984,"",null,null,null,"",0]
[null,null,985,"",null,null,null,"",0]
[null,null,986,"",null,null,null,"",0]
[null,null,987,"",null,null,null,"",0]
[null,null,988,"",null,null,null,"",0]
[null,null,989,"",null,null,null,"",0]
[null,null,990,"",null,null,null,"",0]
[null,null,991,"",null,null,null,"",0]
[null,null,992,"",null,null,null,"",0]
[null,null,993,"",null,null,null,"",0]
[null,null,994,"",null,null,null,"",0]
[null,null,995,"",null,null,null,"",0]
[null,null,996,"",null,null,null,"",0]
[null,null,997,"",null,null,null,"",0]
[null,null,998,"",null,null,null,"",0]
[null,null,999,"",null,null,null,"",0]
[null,null,1000,"",null,null,null,"",0]
[null,null,1001,"",null,null,null,"",0]
[null,null,1002,"",null,null,null,"",0]
[null,null,1003,"",null,null,null,"",0]
[null,null,1004,"",null,null,null,"",0]
[null,null,1005,"",null,null,null,"",0]
[null,null,1006,"",null,null,null,"",0]
[null,null,1007,"",null,null,null,"",0]
[null,null,1008,"",null,null,null,"",0]
[null,null,1009,"",null,null,null,"",0]
[null,null,1010,"",null,null,null,"",0]
[null,null,1011,"",null,null,null,"",0]
[null,null,1012,"",null,null,null,"",0]
[null,null,1013,"",null,null,null,"",0]
[null,null,1014,"",null,null,null,"",0]
[null,null,1015,"",null,null,null,"",0]
[null,null,1016,"",null,null,null,"",0]
[null,null,1017,"",null,null,null,"",0]
[null,null,1018,"",null,null,null,"",0]
[null,null,1019,"",null,null,null,"",0]
[null,null,1020,"",null,null,null,"",0]
[null,null,1021,"",null,null,null,"",0]
[null,null,1022,"",null,null,null,"",0]
[null,null,1023,"",null,null,null,"",0]
[null,null,1024,"",null,null,null,"",0]
[null,null,1025,"",null,null,null,"",0]
[null,null,1026,"",null,null,null,"",0]
[null,null,1027,"",null,null,null,"",0]
[null,null,1028,"",null,null,null,"",0]
[null,null,1029,"",null,null,null,"",0]
[null,null,1030,"",null,null,null,"",0]
[null,null,1031,"",null,null,null,"",0]
[null,null,1032,"",null,null,null,"",0]
[null,null,1033,"",null,null,null,"",0]
[null,null,1034,"",null,null,null,"",0]
[null,null,1035,"",null,null,null,"",0]
[null,null,1036,"",null,null,null,"",0]
[null,null,1037,"",null,null,null,"",0]
[null,null,1038,"",null,null,null,"",0]
[null,null,1039,"",null,null,null,"",0]
[null,null,1040,"",null,null,null,"",0]
[null,null,1041,"",null,null,null,"",0]
[null,null,1042,"",null,null,null,"",0]
[null,null,1043,"",null,null,null,"",0]
[null,null,1044,"",null,null,null,"",0]
[null,null,1045,"",null,null,null,"",0]
[null,null,1046,"",null,null,null,"",0]
[null,null,1047,"",null,null,null,"",0]
[null,null,1048,"",null,null,null,"",0]
[null,null,1049,"",null,null,null,"",0]
[null,null,1050,"",null,null,null,"",0]
[null,null,1051,"",null,null,null,"",0]
[null,null,1052,"",null,null,null,"",0]
[null,null,1053,"",null,null,null,"",0]
[null,null,1054,"",null,null,null,"",0]
[null,null,1055,"",null,null,null,"",0]
[null,null,1056,"",null,null,null,"",0]
[null,null,1057,"",null,null,null,"",0]
[null,null,1058,"",null,null,null,"",0]
[null,null,1059,"",null,null,null,"",0]
[null,null,1060,"",null,null,null,"",0]
[null,null,1061,"",null,null,null,"",0]
[null,null,1062,"",null,null,null,"",0]
[null,null,1063,"",null,null,null,"",0]
[null,null,1064,"",null,null,null,"",0]
[null,null,1065,"",null,null,null,"",0]
[null,null,1066,"",null,null,null,"",0]
[null,null,1067,"",null,null,null,"",0]
[null,null,1068,"",null,null,null,"",0]
[null,null,1069,"",null,null,null,"",0]
[null,null,1070,"",null,null,null,"",0]
[null,null,1071,"",null,null,null,"",0]
[null,null,1072,"",null,null,null,"",0]
[null,null,1073,"",null,null,null,"",0]
[null,null,1074,"",null,null,null,"",0]
[null,null,1075,"",null,null,null,"",0]
[null,null,1076,"",null,null,null,"",0]
[null,null,1077,"",null,null,null,"",0]
[null,null,1078,"",null,null,null,"",0]
[null,null,1079,"",null,null,null,"",0]
[null,null,1080,"",null,null,null,"",0]
[null,null,1081,"",null,null,null,"",0]
[null,null,1082,"",null,null,null,"",0]
[null,null,1083,"",null,null,null,"",0]
[null,null,1084,"",null,null,null,"",0]
[null,null,1085,"",null,null,null,"",0]
[null,null,1086,"",null,null,null,"",0]
[null,null,1087,"",null,null,null,"",0]
[null,null,1088,"",null,null,null,"",0]
[null,null,1089,"",null,null,null,"",0]
[null,null,1090,"",null,null,null,"",0]
[null,null,1091,"",null,null,null,"",0]
[null,null,1092,"",null,null,null,"",0]
[null,null,1093,"",null,null,null,"",0]
[null,null,1094,"",null,null,null,"",0]
[null,null,1095,"",null,null,null,"",0]
[null,null,1096,"",null,null,null,"",0]
[null,null,1097,"",null,null,null,"",0]
[null,null,1098,"",null,null,null,"",0]
[null,null,1099,"",null,null,null,"",0]
[null,null,1100,"",null,null,null,"",0]
[null,null,1101,"",null,null,null,"",0]
[null,null,1102,"",null,null,null,"",0]
[null,null,1103,"",null,null,null,"",0]
[null,null,1104,"",null,null,null,"",0]
[null,null,1105,"",null,null,null,"",0]
[null,null,1106,"",null,null,null,"",0]
[null,null,1107,"",null,null,null,"",0]
[null,null,1108,"",null,null,null,"",0]
[null,null,1109,"",null,null,null,"",0]
[null,null,1110,"",null,null,null,"",0]
[null,null,1111,"",null,null,null,"",0]
[null,null,1112,"",null,null,null,"",0]
[null,null,1113,"",null,null,null,"",0]
[null,null,1114,"",null,null,null,"",0]
[null,null,1115,"",null,null,null,"",0]
[null,null,1116,"",null,null,null,"",0]
[null,null,1117,"",null,null,null,"",0]
[null,null,1118,"",null,null,null,"",0]
[null,null,1119,"",null,null,null,"",0]
[null,null,1120,"",null,null,null,"",0]
[null,null,1121,"",null,null,null,"",0]
[null,null,1122,"",null,null,null,"",0]
[null,null,1123,"",null,null,null,"",0]
[null,null,1124,"",null,null,null,"",0]
[null,null,1125,"",null,null,null,"",0]
[null,null,1126,"",null,null,null,"",0]
[null,null,1127,"",null,null,null,"",0]
[null,null,1128,"",null,null,null,"",0]
[null,null,1129,"",null,null,null,"",0]
[null,null,1130,"",null,null,null,"",0]
[null,null,1131,"",null,null,null,"",0]
[null,null,1132,"",null,null,null,"",0]
[null,null,1133,"",null,null,null,"",0]
[null,null,1134,"",null,null,null,"",0]
[null,null,1135,"",null,null,null,"",0]
[null,null,1136,"",null,null,null,"",0]
[null,null,1137,"",null,null,null,"",0]
[null,null,1138,"",null,null,null,"",0]
[null,null,1139,"",null,null,null,"",0]
[null,null,1140,"",null,null,null,"",0]
[null,null,1141,"",null,null,null,"",0]
[null,null,1142,"",null,null,null,"",0]
[null,null,1143,"",null,null,null,"",0]
[null,null,1144,"",null,null,null,"",0]
[null,null,1145,"",null,null,null,"",0]
[null,null,1146,"",null,null,null,"",0]
[null,null,1147,"",null,null,null,"",0]
[null,null,1148,"",null,null,null,"",0]
[null,null,1149,"",null,null,null,"",0]
[null,null,1150,"",null,null,null,"",0]
[null,null,1151,"",null,null,null,"",0]
[null,null,1152,"",null,null,null,"",0]
[null,null,1153,"",null,null,null,"",0]
[null,null,1154,"",null,null,null,"",0]
[null,null,1155,"",null,null,null,"",0]
[null,null,1156,"",null,null,null,"",0]
[null,null,1157,"",null,null,null,"",0]
[null,null,1158,"",null,null,null,"",0]
[null,null,1159,"",null,null,null,"",0]
[null,null,1160,"",null,null,null,"",0]
[null,null,1161,"",null,null,null,"",0]
[null,null,1162,"",null,null,null,"",0]
[null,null,1163,"",null,null,null,"",0]
[null,null,1164,"",null,null,null,"",0]
[null,null,1165,"",null,null,null,"",0]
[null,null,1166,"",null,null,null,"",0]
[null,null,1167,"",null,null,null,"",0]
[null,null,1168,"",null,null,null,"",0]
[null,null,1169,"",null,null,null,"",0]
[null,null,1170,"",null,null,null,"",0]
[null,null,1171,"",null,null,null,"",0]
[null,null,1172,"",null,null,null,"",0]
[null,null,1173,"",null,null,null,"",0]
[null,null,1174,"",null,null,null,"",0]
[null,null,1175,"",null,null,null,"",0]
[null,null,1176,"",null,null,null,"",0]
[null,null,1177,"",null,null,null,"",0]
[null,null,1178,"",null,null,null,"",0]
[null,null,1179,"",null,null,null,"",0]
[null,null,1180,"",null,null,null,"",0]
[null,null,1181,"",null,null,null,"",0]
[null,null,1182,"",null,null,null,"",0]
[null,null,1183,"",null,null,null,"",0]
[null,null,1184,"",null,null,null,"",0]
[null,null,1185,"",null,null,null,"",0]
[null,null,1186,"",null,null,null,"",0]
[null,null,1187,"",null,null,null,"",0]
[null,null,1188,"",null,null,null,"",0]
[null,null,1189,"",null,null,null,"",0]
[null,null,1190,"",null,null,null,"",0]
[null,null,1191,"",null,null,null,"",0]
[null,null,1192,"",null,null,null,"",0]
[null,null,1193,"",null,null,null,"",0]
[null,null,1194,"",null,null,null,"",0]
[null,null,1195,"",null,null,null,"",0]
[null,null,1196,"",null,null,null,"",0]
[null,null,1197,"",null,null,null,"",0]
[null,null,1198,"",null,null,null,"",0]
[null,null,1199,"",null,null,null,"",0]
[null,null,1200,"",null,null,null,"",0]
[null,null,1201,"",null,null,null,"",0]
[null,null,1202,"",null,null,null,"",0]
[null,null,1203,"",null,null,null,"",0]
[null,null,1204,"",null,null,null,"",0]
[null,null,1205,"",null,null,null,"",0]
[null,null,1206,"",null,null,null,"",0]
[null,null,1207,"",null,null,null,"",0]
[null,null,1208,"",null,null,null,"",0]
[null,null,1209,"",null,null,null,"",0]
[null,null,1210,"",null,null,null,"",0]
[null,null,1211,"",null,null,null,"",0]
[null,null,1212,"",null,null,null,"",0]
[null,null,1213,"",null,null,null,"",0]
[null,null,1214,"",null,null,null,"",0]
[null,null,1215,"",null,null,null,"",0]
[null,null,1216,"",null,null,null,"",0]
[null,null,1217,"",null,null,null,"",0]
[null,null,1218,"",null,null,null,"",0]
[null,null,1219,"",null,null,null,"",0]
[null,null,1220,"",null,null,null,"",0]
[null,null,1221,"",null,null,null,"",0]
[null,null,1222,"",null,null,null,"",0]
[null,null,1223,"",null,null,null,"",0]
[null,null,1224,"",null,null,null,"",0]
[null,null,1225,"",null,null,null,"",0]
[null,null,1226,"",null,null,null,"",0]
[null,null,1227,"",null,null,null,"",0]
[null,null,1228,"",null,null,null,"",0]
[null,null,1229,"",null,null,null,"",0]
[null,null,1230,"",null,null,null,"",0]
[null,null,1231,"",null,null,null,"",0]
[null,null,1232,"",null,null,null,"",0]
[null,null,1233,"",null,null,null,"",0]
[null,null,1234,"",null,null,null,"",0]
[null,null,1235,"",null,null,null,"",0]
[null,null,1236,"",null,null,null,"",0]
[null,null,1237,"",null,null,null,"",0]
[null,null,1238,"",null,null,null,"",0]
[null,null,1239,"",null,null,null,"",0]
[null,null,1240,"",null,null,null,"",0]
[null,null,1241,"",null,null,null,"",0]
[null,null,1242,"",null,null,null,"",0]
[null,null,1243,"",null,null,null,"",0]
[null,null,1244,"",null,null,null,"",0]
[null,null,1245,"",null,null,null,"",0]
[null,null,1246,"",null,null,null,"",0]
[null,null,1247,"",null,null,null,"",0]
[null,null,1248,"",null,null,null,"",0]
[null,null,1249,"",null,null,null,"",0]
[null,null,1250,"",null,null,null,"",0]
[null,null,1251,"",null,null,null,"",0]
[null,null,1252,"",null,null,null,"",0]
[null,null,1253,"",null,null,null,"",0]
[null,null,1254,"",null,null,null,"",0]
[null,null,1255,"",null,null,null,"",0]
[null,null,1256,"",null,null,null,"",0]
[null,null,1257,"",null,null,null,"",0]
[null,null,1258,"",null,null,null,"",0]
[null,null,1259,"",null,null,null,"",0]
[null,null,1260,"",null,null,null,"",0]
[null,null,1261,"",null,null,null,"",0]
[null,null,1262,"",null,null,null,"",0]
[null,null,1263,"",null,null,null,"",0]
[null,null,1264,"",null,null,null,"",0]
[null,null,1265,"",null,null,null,"",0]
[null,null,1266,"",null,null,null,"",0]
[null,null,1267,"",null,null,null,"",0]
[null,null,1268,"",null,null,null,"",0]
[null,null,1269,"",null,null,null,"",0]
[null,null,1270,"",null,null,null,"",0]
[null,null,1271,"",null,null,null,"",0]
[null,null,1272,"",null,null,null,"",0]
[null,null,1273,"",null,null,null,"",0]
[null,null,1274,"",null,null,null,"",0]
[null,null,1275,"",null,null,null,"",0]
[null,null,1276,"",null,null,null,"",0]
[null,null,1277,"",null,null,null,"",0]
[null,null,1278,"",null,null,null,"",0]
[null,null,1279,"",null,null,null,"",0]
[null,null,1280,"",null,null,null,"",0]
[null,null,1281,"",null,null,null,"",0]
[null,null,1282,"",null,null,null,"",0]
[null,null,1283,"",null,null,null,"",0]
[null,null,1284,"",null,null,null,"",0]
[null,null,1285,"",null,null,null,"",0]
[null,null,1286,"",null,null,null,"",0]
[null,null,1287,"",null,null,null,"",0]
[null,null,1288,"",null,null,null,"",0]
[null,null,1289,"",null,null,null,"",0]
[null,null,1290,"",null,null,null,"",0]
[null,null,1291,"",null,null,null,"",0]
[null,null,1292,"",null,null,null,"",0]
[null,null,1293,"",null,null,null,"",0]
[null,null,1294,"",null,null,null,"",0]
[null,null,1295,"",null,null,null,"",0]
[null,null,1296,"",null,null,null,"",0]
[null,null,1297,"",null,null,null,"",0]
[null,null,1298,"",null,null,null,"",0]
[null,null,1299,"",null,null,null,"",0]
[null,null,1300,"",null,null,null,"",0]
[null,null,1301,"",null,null,null,"",0]
[null,null,1302,"",null,null,null,"",0]
[null,null,1303,"",null,null,null,"",0]
[null,null,1304,"",null,null,null,"",0]
[null,null,1305,"",null,null,null,"",0]
[null,null,1306,"",null,null,null,"",0]
[null,null,1307,"",null,null,null,"",0]
[null,null,1308,"",null,null,null,"",0]
[null,null,1309,"",null,null,null,"",0]
[null,null,1310,"",null,null,null,"",0]
[null,null,1311,"",null,null,null,"",0]
[null,null,1312,"",null,null,null,"",0]
[null,null,1313,"",null,null,null,"",0]
[null,null,1314,"",null,null,null,"",0]
[null,null,1315,"",null,null,null,"",0]
[null,null,1316,"",null,null,null,"",0]
[null,null,1317,"",null,null,null,"",0]
[null,null,1318,"",null,null,null,"",0]
[null,null,1319,"",null,null,null,"",0]
[null,null,1320,"",null,null,null,"",0]
[null,null,1321,"",null,null,null,"",0]
[null,null,1322,"",null,null,null,"",0]
[null,null,1323,"",null,null,null,"",0]
[null,null,1324,"",null,null,null,"",0]
[null,null,1325,"",null,null,null,"",0]
[null,null,1326,"",null,null,null,"",0]
[null,null,1327,"",null,null,null,"",0]
[null,null,1328,"",null,null,null,"",0]
[null,null,1329,"",null,null,null,"",0]
[null,null,1330,"",null,null,null,"",0]
[null,null,1331,"",null,null,null,"",0]
[null,null,1332,"",null,null,null,"",0]
[null,null,1333,"",null,null,null,"",0]
[null,null,1334,"",null,null,null,"",0]
[null,null,1335,"",null,null,null,"",0]
[null,null,1336,"",null,null,null,"",0]
[null,null,1337,"",null,null,null,"",0]
[null,null,1338,"",null,null,null,"",0]
[null,null,1339,"",null,null,null,"",0]
[null,null,1340,"",null,null,null,"",0]
[null,null,1341,"",null,null,null,"",0]
[null,null,1342,"",null,null,null,"",0]
[null,null,1343,"",null,null,null,"",0]
[null,null,1344,"",null,null,null,"",0]
[null,null,1345,"",null,null,null,"",0]
[null,null,1346,"",null,null,null,"",0]
[null,null,1347,"",null,null,null,"",0]
[null,null,1348,"",null,null,null,"",0]
[null,null,1349,"",null,null,null,"",0]
[null,null,1350,"",null,null,null,"",0]
[null,null,1351,"",null,null,null,"",0]
[null,null,1352,"",null,null,null,"",0]
[null,null,1353,"",null,null,null,"",0]
[null,null,1354,"",null,null,null,"",0]
[null,null,1355,"",null,null,null,"",0]
[null,null,1356,"",null,null,null,"",0]
[null,null,1357,"",null,null,null,"",0]
[null,null,1358,"",null,null,null,"",0]
[null,null,1359,"",null,null,null,"",0]
[null,null,1360,"",null,null,null,"",0]
[null,null,1361,"",null,null,null,"",0]
[null,null,1362,"",null,null,null,"",0]
[null,null,1363,"",null,null,null,"",0]
[null,null,1364,"",null,null,null,"",0]
[null,null,1365,"",null,null,null,"",0]
[null,null,1366,"",null,null,null,"",0]
[null,null,1367,"",null,null,null,"",0]
[null,null,1368,"",null,null,null,"",0]
[null,null,1369,"",null,null,null,"",0]
[null,null,1370,"",null,null,null,"",0]
[null,null,1371,"",null,null,null,"",0]
[null,null,1372,"",null,null,null,"",0]
[null,null,1373,"",null,null,null,"",0]
[null,null,1374,"",null,null,null,"",0]
[null,null,1375,"",null,null,null,"",0]
[null,null,1376,"",null,null,null,"",0]
[null,null,1377,"",null,null,null,"",0]
[null,null,1378,"",null,null,null,"",0]
[null,null,1379,"",null,null,null,"",0]
[null,null,1380,"",null,null,null,"",0]
[null,null,1381,"",null,null,null,"",0]
[null,null,1382,"",null,null,null,"",0]
[null,null,1383,"",null,null,null,"",0]
[null,null,1384,"",null,null,null,"",0]
[null,null,1385,"",null,null,null,"",0]
[null,null,1386,"",null,null,null,"",0]
[null,null,1387,"",null,null,null,"",0]
[null,null,1388,"",null,null,null,"",0]
[null,null,1389,"",null,null,null,"",0]
[null,null,1390,"",null,null,null,"",0]
[null,null,1391,"",null,null,null,"",0]
[null,null,1392,"",null,null,null,"",0]
[null,null,1393,"",null,null,null,"",0]
[null,null,1394,"",null,null,null,"",0]
[null,null,1395,"",null,null,null,"",0]
[null,null,1396,"",null,null,null,"",0]
[null,null,1397,"",null,null,null,"",0]
[null,null,1398,"",null,null,null,"",0]
[null,null,1399,"",null,null,null,"",0]
[null,null,1400,"",null,null,null,"",0]
[null,null,1401,"",null,null,null,"",0]
[null,null,1402,"",null,null,null,"",0]
[null,null,1403,"",null,null,null,"",0]
[null,null,1404,"",null,null,null,"",0]
[null,null,1405,"",null,null,null,"",0]
[null,null,1406,"",null,null,null,"",0]
[null,null,1407,"",null,null,null,"",0]
[null,null,1408,"",null,null,null,"",0]
[null,null,1409,"",null,null,null,"",0]
[null,null,1410,"",null,null,null,"",0]
[null,null,1411,"",null,null,null,"",0]
[null,null,1412,"",null,null,null,"",0]
[null,null,1413,"",null,null,null,"",0]
[null,null,1414,"",null,null,null,"",0]
[null,null,1415,"",null,null,null,"",0]
[null,null,1416,"",null,null,null,"",0]
[null,null,1417,"",null,null,null,"",0]
[null,null,1418,"",null,null,null,"",0]
[null,null,1419,"",null,null,null,"",0]
[null,null,1420,"",null,null,null,"",0]
[null,null,1421,"",null,null,null,"",0]
[null,null,1422,"",null,null,null,"",0]
[null,null,1423,"",null,null,null,"",0]
[null,null,1424,"",null,null,null,"",0]
[null,null,1425,"",null,null,null,"",0]
[null,null,1426,"",null,null,null,"",0]
[null,null,1427,"",null,null,null,"",0]
[null,null,1428,"",null,null,null,"",0]
[null,null,1429,"",null,null,null,"",0]
[null,null,1430,"",null,null,null,"",0]
[null,null,1431,"",null,null,null,"",0]
[null,null,1432,"",null,null,null,"",0]
[null,null,1433,"",null,null,null,"",0]
[null,null,1434,"",null,null,null,"",0]
[null,null,1435,"",null,null,null,"",0]
[null,null,1436,"",null,null,null,"",0]
[null,null,1437,"",null,null,null,"",0]
[null,null,1438,"",null,null,null,"",0]
[null,null,1439,"",null,null,null,"",0]
[null,null,1440,"",null,null,null,"",0]
[null,null,1441,"",null,null,null,"",0]
[null,null,1442,"",null,null,null,"",0]
[null,null,1443,"",null,null,null,"",0]
[null,null,1444,"",null,null,null,"",0]
[null,null,1445,"",null,null,null,"",0]
[null,null,1446,"",null,null,null,"",0]
[null,null,1447,"",null,null,null,"",0]
[null,null,1448,"",null,null,null,"",0]
[null,null,1449,"",null,null,null,"",0]
[null,null,1450,"",null,null,null,"",0]
[null,null,1451,"",null,null,null,"",0]
[null,null,1452,"",null,null,null,"",0]
[null,null,1453,"",null,null,null,"",0]
[null,null,1454,"",null,null,null,"",0]
[null,null,1455,"",null,null,null,"",0]
[null,null,1456,"",null,null,null,"",0]
[null,null,1457,"",null,null,null,"",0]
[null,null,1458,"",null,null,null,"",0]
[null,null,1459,"",null,null,null,"",0]
[null,null,1460,"",null,null,null,"",0]
[null,null,1461,"",null,null,null,"",0]
[null,null,1462,"",null,null,null,"",0]
[null,null,1463,"",null,null,null,"",0]
[null,null,1464,"",null,null,null,"",0]
[null,null,1465,"",null,null,null,"",0]
[null,null,1466,"",null,null,null,"",0]
[null,null,1467,"",null,null,null,"",0]
[null,null,1468,"",null,null,null,"",0]
[null,null,1469,"",null,null,null,"",0]
[null,null,1470,"",null,null,null,"",0]
[null,null,1471,"",null,null,null,"",0]
[null,null,1472,"",null,null,null,"",0]
[null,null,1473,"",null,null,null,"",0]
[null,null,1474,"",null,null,null,"",0]
[null,null,1475,"",null,null,null,"",0]
[null,null,1476,"",null,null,null,"",0]
[null,null,1477,"",null,null,null,"",0]
[null,null,1478,"",null,null,null,"",0]
[null,null,1479,"",null,null,null,"",0]
[null,null,1480,"",null,null,null,"",0]
[null,null,1481,"",null,null,null,"",0]
[null,null,1482,"",null,null,null,"",0]
[null,null,1483,"",null,null,null,"",0]
[null,null,1484,"",null,null,null,"",0]
[null,null,1485,"",null,null,null,"",0]
[null,null,1486,"",null,null,null,"",0]
[null,null,1487,"",null,null,null,"",0]
[null,null,1488,"",null,null,null,"",0]
[null,null,1489,"",null,null,null,"",0]
[null,null,1490,"",null,null,null,"",0]
[null,null,1491,"",null,null,null,"",0]
[null,null,1492,"",null,null,null,"",0]
[null,null,1493,"",null,null,null,"",0]
[null,null,1494,"",null,null,null,"",0]
[null,null,1495,"",null,null,null,"",0]
[null,null,1496,"",null,null,null,"",0]
[null,null,1497,"",null,null,null,"",0]
[null,null,1498,"",null,null,null,"",0]
[null,null,1499,"",null,null,null,"",0]
[null,null,1500,"",null,null,null,"",0]
[null,null,1501,"",null,null,null,"",0]
[null,null,1502,"",null,null,null,"",0]
[null,null,1503,"",null,null,null,"",0]
[null,null,1504,"",null,null,null,"",0]
[null,null,1505,"",null,null,null,"",0]
[null,null,1506,"",null,null,null,"",0]
[null,null,1507,"",null,null,null,"",0]
[null,null,1508,"",null,null,null,"",0]
[null,null,1509,"",null,null,null,"",0]
[null,null,1510,"",null,null,null,"",0]
[null,null,1511,"",null,null,null,"",0]
[null,null,1512,"",null,null,null,"",0]
[null,null,1513,"",null,null,null,"",0]
[null,null,1514,"",null,null,null,"",0]
[null,null,1515,"",null,null,null,"",0]
[null,null,1516,"",null,null,null,"",0]
[null,null,1517,"",null,null,null,"",0]
[null,null,1518,"",null,null,null,"",0]
[null,null,1519,"",null,null,null,"",0]
[null,null,1520,"",null,null,null,"",0]
[null,null,1521,"",null,null,null,"",0]
[null,null,1522,"",null,null,null,"",0]
[null,null,1523,"",null,null,null,"",0]
[null,null,1524,"",null,null,null,"",0]
[null,null,1525,"",null,null,null,"",0]
[null,null,1526,"",null,null,null,"",0]
[null,null,1527,"",null,null,null,"",0]
[null,null,1528,"",null,null,null,"",0]
[null,null,1529,"",null,null,null,"",0]
[null,null,1530,"",null,null,null,"",0]
[null,null,1531,"",null,null,null,"",0]
[null,null,1532,"",null,null,null,"",0]
[null,null,1533,"",null,null,null,"",0]
[null,null,1534,"",null,null,null,"",0]
[null,null,1535,"",null,null,null,"",0]
[null,null,1536,"",null,null,null,"",0]
[null,null,1537,"",null,null,null,"",0]
[null,null,1538,"",null,null,null,"",0]
[null,null,1539,"",null,null,null,"",0]
[null,null,1540,"",null,null,null,"",0]
[null,null,1541,"",null,null,null,"",0]
[null,null,1542,"",null,null,null,"",0]
[null,null,1543,"",null,null,null,"",0]
[null,null,1544,"",null,null,null,"",0]
[null,null,1545,"",null,null,null,"",0]
[null,null,1546,"",null,null,null,"",0]
[null,null,1547,"",null,null,null,"",0]
[null,null,1548,"",null,null,null,"",0]
[null,null,1549,"",null,null,null,"",0]
[null,null,1550,"",null,null,null,"",0]
[null,null,1551,"",null,null,null,"",0]
[null,null,1552,"",null,null,null,"",0]
[null,null,1553,"",null,null,null,"",0]
[null,null,1554,"",null,null,null,"",0]
[null,null,1555,"",null,null,null,"",0]
[null,null,1556,"",null,null,null,"",0]
[null,null,1557,"",null,null,null,"",0]
[null,null,1558,"",null,null,null,"",0]
[null,null,1559,"",null,null,null,"",0]
[null,null,1560,"",null,null,null,"",0]
[null,null,1561,"",null,null,null,"",0]
[null,null,1562,"",null,null,null,"",0]
[null,null,1563,"",null,null,null,"",0]
[null,null,1564,"",null,null,null,"",0]
[null,null,1565,"",null,null,null,"",0]
[null,null,1566,"",null,null,null,"",0]
[null,null,1567,"",null,null,null,"",0]
[null,null,1568,"",null,null,null,"",0]
[null,null,1569,"",null,null,null,"",0]
[null,null,1570,"",null,null,null,"",0]
[null,null,1571,"",null,null,null,"",0]
[null,null,1572,"",null,null,null,"",0]
[null,null,1573,"",null,null,null,"",0]
[null,null,1574,"",null,null,null,"",0]
[null,null,1575,"",null,null,null,"",0]
[null,null,1576,"",null,null,null,"",0]
[null,null,1577,"",null,null,null,"",0]
[null,null,1578,"",null,null,null,"",0]
[null,null,1579,"",null,null,null,"",0]
[null,null,1580,"",null,null,null,"",0]
[null,null,1581,"",null,null,null,"",0]
[null,null,1582,"",null,null,null,"",0]
[null,null,1583,"",null,null,null,"",0]
[null,null,1584,"",null,null,null,"",0]
[null,null,1585,"",null,null,null,"",0]
[null,null,1586,"",null,null,null,"",0]
[null,null,1587,"",null,null,null,"",0]
[null,null,1588,"",null,null,null,"",0]
[null,null,1589,"",null,null,null,"",0]
[null,null,1590,"",null,null,null,"",0]
[null,null,1591,"",null,null,null,"",0]
[null,null,1592,"",null,null,null,"",0]
[null,null,1593,"",null,null,null,"",0]
[null,null,1594,"",null,null,null,"",0]
[null,null,1595,"",null,null,null,"",0]
[null,null,1596,"",null,null,null,"",0]
[null,null,1597,"",null,null,null,"",0]
[null,null,1598,"",null,null,null,"",0]
[null,null,1599,"",null,null,null,"",0]
[null,null,1600,"",null,null,null,"",0]
[null,null,1601,"",null,null,null,"",0]
[null,null,1602,"",null,null,null,"",0]
[null,null,1603,"",null,null,null,"",0]
[null,null,1604,"",null,null,null,"",0]
[null,null,1605,"",null,null,null,"",0]
[null,null,1606,"",null,null,null,"",0]
[null,null,1607,"",null,null,null,"",0]
[null,null,1608,"",null,null,null,"",0]
[null,null,1609,"",null,null,null,"",0]
[null,null,1610,"",null,null,null,"",0]
[null,null,1611,"",null,null,null,"",0]
[null,null,1612,"",null,null,null,"",0]
[null,null,1613,"",null,null,null,"",0]
[null,null,1614,"",null,null,null,"",0]
[null,null,1615,"",null,null,null,"",0]
[null,null,1616,"",null,null,null,"",0]
[null,null,1617,"",null,null,null,"",0]
[null,null,1618,"",null,null,null,"",0]
[null,null,1619,"",null,null,null,"",0]
[null,null,1620,"",null,null,null,"",0]
[null,null,1621,"",null,null,null,"",0]
[null,null,1622,"",null,null,null,"",0]
[null,null,1623,"",null,null,null,"",0]
[null,null,1624,"",null,null,null,"",0]
[null,null,1625,"",null,null,null,"",0]
[null,null,1626,"",null,null,null,"",0]
[null,null,1627,"",null,null,null,"",0]
[null,null,1628,"",null,null,null,"",0]
[null,null,1629,"",null,null,null,"",0]
[null,null,1630,"",null,null,null,"",0]
[null,null,1631,"",null,null,null,"",0]
[null,null,1632,"",null,null,null,"",0]
[null,null,1633,"",null,null,null,"",0]
[null,null,1634,"",null,null,null,"",0]
[null,null,1635,"",null,null,null,"",0]
[null,null,1636,"",null,null,null,"",0]
[null,null,1637,"",null,null,null,"",0]
[null,null,1638,"",null,null,null,"",0]
[null,null,1639,"",null,null,null,"",0]
[null,null,1640,"",null,null,null,"",0]
[null,null,1641,"",null,null,null,"",0]
[null,null,1642,"",null,null,null,"",0]
[null,null,1643,"",null,null,null,"",0]
[null,null,1644,"",null,null,null,"",0]
[null,null,1645,"",null,null,null,"",0]
[null,null,1646,"",null,null,null,"",0]
[null,null,1647,"",null,null,null,"",0]
[null,null,1648,"",null,null,null,"",0]
[null,null,1649,"",null,null,null,"",0]
[null,null,1650,"",null,null,null,"",0]
[null,null,1651,"",null,null,null,"",0]
[null,null,1652,"",null,null,null,"",0]
[null,null,1653,"",null,null,null,"",0]
[null,null,1654,"",null,null,null,"",0]
[null,null,1655,"",null,null,null,"",0]
[null,null,1656,"",null,null,null,"",0]
[null,null,1657,"",null,null,null,"",0]
[null,null,1658,"",null,null,null,"",0]
[null,null,1659,"",null,null,null,"",0]
[null,null,1660,"",null,null,null,"",0]
[null,null,1661,"",null,null,null,"",0]
[null,null,1662,"",null,null,null,"",0]
[null,null,1663,"",null,null,null,"",0]
[null,null,1664,"",null,null,null,"",0]
[null,null,1665,"",null,null,null,"",0]
[null,null,1666,"",null,null,null,"",0]
[null,null,1667,"",null,null,null,"",0]
[null,null,1668,"",null,null,null,"",0]
[null,null,1669,"",null,null,null,"",0]
[null,null,1670,"",null,null,null,"",0]
[null,null,1671,"",null,null,null,"",0]
[null,null,1672,"",null,null,null,"",0]
[null,null,1673,"",null,null,null,"",0]
[null,null,1674,"",null,null,null,"",0]
[null,null,1675,"",null,null,null,"",0]
[null,null,1676,"",null,null,null,"",0]
[null,null,1677,"",null,null,null,"",0]
[null,null,1678,"",null,null,null,"",0]
[null,null,1679,"",null,null,null,"",0]
[null,null,1680,"",null,null,null,"",0]
[null,null,1681,"",null,null,null,"",0]
[null,null,1682,"",null,null,null,"",0]
[null,null,1683,"",null,null,null,"",0]
[null,null,1684,"",null,null,null,"",0]
[null,null,1685,"",null,null,null,"",0]
[null,null,1686,"",null,null,null,"",0]
[null,null,1687,"",null,null,null,"",0]
[null,null,1688,"",null,null,null,"",0]
[null,null,1689,"",null,null,null,"",0]
[null,null,1690,"",null,null,null,"",0]
[null,null,1691,"",null,null,null,"",0]
[null,null,1692,"",null,null,null,"",0]
[null,null,1693,"",null,null,null,"",0]
[null,null,1694,"",null,null,null,"",0]
[null,null,1695,"",null,null,null,"",0]
[null,null,1696,"",null,null,null,"",0]
[null,null,1697,"",null,null,null,"",0]
[null,null,1698,"",null,null,null,"",0]
[null,null,1699,"",null,null,null,"",0]
[null,null,1700,"",null,null,null,"",0]
[null,null,1701,"",null,null,null,"",0]
[null,null,1702,"",null,null,null,"",0]
[null,null,1703,"",null,null,null,"",0]
[null,null,1704,"",null,null,null,"",0]
[null,null,1705,"",null,null,null,"",0]
[null,null,1706,"",null,null,null,"",0]
[null,null,1707,"",null,null,null,"",0]
[null,null,1708,"",null,null,null,"",0]
[null,null,1709,"",null,null,null,"",0]
[null,null,1710,"",null,null,null,"",0]
[null,null,1711,"",null,null,null,"",0]
[null,null,1712,"",null,null,null,"",0]
[null,null,1713,"",null,null,null,"",0]
[null,null,1714,"",null,null,null,"",0]
[null,null,1715,"",null,null,null,"",0]
[null,null,1716,"",null,null,null,"",0]
[null,null,1717,"",null,null,null,"",0]
[null,null,1718,"",null,null,null,"",0]
[null,null,1719,"",null,null,null,"",0]
[null,null,1720,"",null,null,null,"",0]
[null,null,1721,"",null,null,null,"",0]
[null,null,1722,"",null,null,null,"",0]
[null,null,1723,"",null,null,null,"",0]
[null,null,1724,"",null,null,null,"",0]
[null,null,1725,"",null,null,null,"",0]
[null,null,1726,"",null,null,null,"",0]
[null,null,1727,"",null,null,null,"",0]
[null,null,1728,"",null,null,null,"",0]
[null,null,1729,"",null,null,null,"",0]
[null,null,1730,"",null,null,null,"",0]
[null,null,1731,"",null,null,null,"",0]
[null,null,1732,"",null,null,null,"",0]
[null,null,1733,"",null,null,null,"",0]
[null,null,1734,"",null,null,null,"",0]
[null,null,1735,"",null,null,null,"",0]
[null,null,1736,"",null,null,null,"",0]
[null,null,1737,"",null,null,null,"",0]
[null,null,1738,"",null,null,null,"",0]
[null,null,1739,"",null,null,null,"",0]
[null,null,1740,"",null,null,null,"",0]
[null,null,1741,"",null,null,null,"",0]
[null,null,1742,"",null,null,null,"",0]
[null,null,1743,"",null,null,null,"",0]
[null,null,1744,"",null,null,null,"",0]
[null,null,1745,"",null,null,null,"",0]
[null,null,1746,"",null,null,null,"",0]
[null,null,1747,"",null,null,null,"",0]
[null,null,1748,"",null,null,null,"",0]
[null,null,1749,"",null,null,null,"",0]
[null,null,1750,"",null,null,null,"",0]
[null,null,1751,"",null,null,null,"",0]
[null,null,1752,"",null,null,null,"",0]
[null,null,1753,"",null,null,null,"",0]
[null,null,1754,"",null,null,null,"",0]
[null,null,1755,"",null,null,null,"",0]
[null,null,1756,"",null,null,null,"",0]
[null,null,1757,"",null,null,null,"",0]
[null,null,1758,"",null,null,null,"",0]
[null,null,1759,"",null,null,null,"",0]
[null,null,1760,"",null,null,null,"",0]
[null,null,1761,"",null,null,null,"",0]
[null,null,1762,"",null,null,null,"",0]
[null,null,1763,"",null,null,null,"",0]
[null,null,1764,"",null,null,null,"",0]
[null,null,1765,"",null,null,null,"",0]
[null,null,1766,"",null,null,null,"",0]
[null,null,1767,"",null,null,null,"",0]
[null,null,1768,"",null,null,null,"",0]
[null,null,1769,"",null,null,null,"",0]
[null,null,1770,"",null,null,null,"",0]
[null,null,1771,"",null,null,null,"",0]
[null,null,1772,"",null,null,null,"",0]
[null,null,1773,"",null,null,null,"",0]
[null,null,1774,"",null,null,null,"",0]
[null,null,1775,"",null,null,null,"",0]
[null,null,1776,"",null,null,null,"",0]
[null,null,1777,"",null,null,null,"",0]
[null,null,1778,"",null,null,null,"",0]
[null,null,1779,"",null,null,null,"",0]
[null,null,1780,"",null,null,null,"",0]
[null,null,1781,"",null,null,null,"",0]
[null,null,1782,"",null,null,null,"",0]
[null,null,1783,"",null,null,null,"",0]
[null,null,1784,"",null,null,null,"",0]
[null,null,1785,"",null,null,null,"",0]
[null,null,1786,"",null,null,null,"",0]
[null,null,1787,"",null,null,null,"",0]
[null,null,1788,"",null,null,null,"",0]
[null,null,1789,"",null,null,null,"",0]
[null,null,1790,"",null,null,null,"",0]
[null,null,1791,"",null,null,null,"",0]
[null,null,1792,"",null,null,null,"",0]
[null,null,1793,"",null,null,null,"",0]
[null,null,1794,"",null,null,null,"",0]
[null,null,1795,"",null,null,null,"",0]
[null,null,1796,"",null,null,null,"",0]
[null,null,1797,"",null,null,null,"",0]
[null,null,1798,"",null,null,null,"",0]
[null,null,1799,"",null,null,null,"",0]
[null,null,1800,"",null,null,null,"",0]
[null,null,1801,"",null,null,null,"",0]
[null,null,1802,"",null,null,null,"",0]
[null,null,1803,"",null,null,null,"",0]
[null,null,1804,"",null,null,null,"",0]
[null,null,1805,"",null,null,null,"",0]
[null,null,1806,"",null,null,null,"",0]
[null,null,1807,"",null,null,null,"",0]
[null,null,1808,"",null,null,null,"",0]
[null,null,1809,"",null,null,null,"",0]
[null,null,1810,"",null,null,null,"",0]
[null,null,1811,"",null,null,null,"",0]
[null,null,1812,"",null,null,null,"",0]
[null,null,1813,"",null,null,null,"",0]
[null,null,1814,"",null,null,null,"",0]
[null,null,1815,"",null,null,null,"",0]
[null,null,1816,"",null,null,null,"",0]
[null,null,1817,"",null,null,null,"",0]
[null,null,1818,"",null,null,null,"",0]
[null,null,1819,"",null,null,null,"",0]
[null,null,1820,"",null,null,null,"",0]
[null,null,1821,"",null,null,null,"",0]
[null,null,1822,"",null,null,null,"",0]
[null,null,1823,"",null,null,null,"",0]
[null,null,1824,"",null,null,null,"",0]
[null,null,1825,"",null,null,null,"",0]
[null,null,1826,"",null,null,null,"",0]
[null,null,1827,"",null,null,null,"",0]
[null,null,1828,"",null,null,null,"",0]
[null,null,1829,"",null,null,null,"",0]
[null,null,1830,"",null,null,null,"",0]
[null,null,1831,"",null,null,null,"",0]
[null,null,1832,"",null,null,null,"",0]
[null,null,1833,"",null,null,null,"",0]
[null,null,1834,"",null,null,null,"",0]
[null,null,1835,"",null,null,null,"",0]
[null,null,1836,"",null,null,null,"",0]
[null,null,1837,"",null,null,null,"",0]
[null,null,1838,"",null,null,null,"",0]
[null,null,1839,"",null,null,null,"",0]
[null,null,1840,"",null,null,null,"",0]
[null,null,1841,"",null,null,null,"",0]
[null,null,1842,"",null,null,null,"",0]
[null,null,1843,"",null,null,null,"",0]
[null,null,1844,"",null,null,null,"",0]
[null,null,1845,"",null,null,null,"",0]
[null,null,1846,"",null,null,null,"",0]
[null,null,1847,"",null,null,null,"",0]
[null,null,1848,"",null,null,null,"",0]
[null,null,1849,"",null,null,null,"",0]
[null,null,1850,"",null,null,null,"",0]
[null,null,1851,"",null,null,null,"",0]
[null,null,1852,"",null,null,null,"",0]
[null,null,1853,"",null,null,null,"",0]
[null,null,1854,"",null,null,null,"",0]
[null,null,1855,"",null,null,null,"",0]
[null,null,1856,"",null,null,null,"",0]
[null,null,1857,"",null,null,null,"",0]
[null,null,1858,"",null,null,null,"",0]
[null,null,1859,"",null,null,null,"",0]
[null,null,1860,"",null,null,null,"",0]
[null,null,1861,"",null,null,null,"",0]
[null,null,1862,"",null,null,null,"",0]
[null,null,1863,"",null,null,null,"",0]
[null,null,1864,"",null,null,null,"",0]
[null,null,1865,"",null,null,null,"",0]
[null,null,1866,"",null,null,null,"",0]
[null,null,1867,"",null,null,null,"",0]
[null,null,1868,"",null,null,null,"",0]
[null,null,1869,"",null,null,null,"",0]
[null,null,1870,"",null,null,null,"",0]
[null,null,1871,"",null,null,null,"",0]
[null,null,1872,"",null,null,null,"",0]
[null,null,1873,"",null,null,null,"",0]
[null,null,1874,"",null,null,null,"",0]
[null,null,1875,"",null,null,null,"",0]
[null,null,1876,"",null,null,null,"",0]
[null,null,1877,"",null,null,null,"",0]
[null,null,1878,"",null,null,null,"",0]
[null,null,1879,"",null,null,null,"",0]
[null,null,1880,"",null,null,null,"",0]
[null,null,1881,"",null,null,null,"",0]
[null,null,1882,"",null,null,null,"",0]
[null,null,1883,"",null,null,null,"",0]
[null,null,1884,"",null,null,null,"",0]
[null,null,1885,"",null,null,null,"",0]
[null,null,1886,"",null,null,null,"",0]
[null,null,1887,"",null,null,null,"",0]
[null,null,1888,"",null,null,null,"",0]
[null,null,1889,"",null,null,null,"",0]
[null,null,1890,"",null,null,null,"",0]
[null,null,1891,"",null,null,null,"",0]
[null,null,1892,"",null,null,null,"",0]
[null,null,1893,"",null,null,null,"",0]
[null,null,1894,"",null,null,null,"",0]
[null,null,1895,"",null,null,null,"",0]
[null,null,1896,"",null,null,null,"",0]
[null,null,1897,"",null,null,null,"",0]
[null,null,1898,"",null,null,null,"",0]
[null,null,1899,"",null,null,null,"",0]
[null,null,1900,"",null,null,null,"",0]
[null,null,1901,"",null,null,null,"",0]
[null,null,1902,"",null,null,null,"",0]
[null,null,1903,"",null,null,null,"",0]
[null,null,1904,"",null,null,null,"",0]
[null,null,1905,"",null,null,null,"",0]
[null,null,1906,"",null,null,null,"",0]
[null,null,1907,"",null,null,null,"",0]
[null,null,1908,"",null,null,null,"",0]
[null,null,1909,"",null,null,null,"",0]
[null,null,1910,"",null,null,null,"",0]
[null,null,1911,"",null,null,null,"",0]
[null,null,1912,"",null,null,null,"",0]
[null,null,1913,"",null,null,null,"",0]
[null,null,1914,"",null,null,null,"",0]
[null,null,1915,"",null,null,null,"",0]
[null,null,1916,"",null,null,null,"",0]
[null,null,1917,"",null,null,null,"",0]
[null,null,1918,"",null,null,null,"",0]
[null,null,1919,"",null,null,null,"",0]
[null,null,1920,"",null,null,null,"",0]
[null,null,1921,"",null,null,null,"",0]
[null,null,1922,"",null,null,null,"",0]
[null,null,1923,"",null,null,null,"",0]
[null,null,1924,"",null,null,null,"",0]
[null,null,1925,"",null,null,null,"",0]
[null,null,1926,"",null,null,null,"",0]
[null,null,1927,"",null,null,null,"",0]
[null,null,1928,"",null,null,null,"",0]
[null,null,1929,"",null,null,null,"",0]
[null,null,1930,"",null,null,null,"",0]
[null,null,1931,"",null,null,null,"",0]
[null,null,1932,"",null,null,null,"",0]
[null,null,1933,"",null,null,null,"",0]
[null,null,1934,"",null,null,null,"",0]
[null,null,1935,"",null,null,null,"",0]
[null,null,1936,"",null,null,null,"",0]
[null,null,1937,"",null,null,null,"",0]
[null,null,1938,"",null,null,null,"",0]
[null,null,1939,"",null,null,null,"",0]
[null,null,1940,"",null,null,null,"",0]
[null,null,1941,"",null,null,null,"",0]
[null,null,1942,"",null,null,null,"",0]
[null,null,1943,"",null,null,null,"",0]
[null,null,1944,"",null,null,null,"",0]
[null,null,1945,"",null,null,null,"",0]
[null,null,1946,"",null,null,null,"",0]
[null,null,1947,"",null,null,null,"",0]
[null,null,1948,"",null,null,null,"",0]
[null,null,1949,"",null,null,null,"",0]
[null,null,1950,"",null,null,null,"",0]
[null,null,1951,"",null,null,null,"",0]
[null,null,1952,"",null,null,null,"",0]
[null,null,1953,"",null,null,null,"",0]
[null,null,1954,"",null,null,null,"",0]
[null,null,1955,"",null,null,null,"",0]
[null,null,1956,"",null,null,null,"",0]
[null,null,1957,"",null,null,null,"",0]
[null,null,1958,"",null,null,null,"",0]
[null,null,1959,"",null,null,null,"",0]
[null,null,1960,"",null,null,null,"",0]
[null,null,1961,"",null,null,null,"",0]
[null,null,1962,"",null,null,null,"",0]
[null,null,1963,"",null,null,null,"",0]
[null,null,1964,"",null,null,null,"",0]
[null,null,1965,"",null,null,null,"",0]
[null,null,1966,"",null,null,null,"",0]
[null,null,1967,"",null,null,null,"",0]
[null,null,1968,"",null,null,null,"",0]
[null,null,1969,"",null,null,null,"",0]
[null,null,1970,"",null,null,null,"",0]
[null,null,1971,"",null,null,null,"",0]
[null,null,1972,"",null,null,null,"",0]
[null,null,1973,"",null,null,null,"",0]
[null,null,1974,"",null,null,null,"",0]
[null,null,1975,"",null,null,null,"",0]
[null,null,1976,"",null,null,null,"",0]
[null,null,1977,"",null,null,null,"",0]
[null,null,1978,"",null,null,null,"",0]
[null,null,1979,"",null,null,null,"",0]
[null,null,1980,"",null,null,null,"",0]
[null,null,1981,"",null,null,null,"",0]
[null,null,1982,"",null,null,null,"",0]
[null,null,1983,"",null,null,null,"",0]
[null,null,1984,"",null,null,null,"",0]
[null,null,1985,"",null,null,null,"",0]
[null,null,1986,"",null,null,null,"",0]
[null,null,1987,"",null,null,null,"",0]
[null,null,1988,"",null,null,null,"",0]
[null,null,1989,"",null,null,null,"",0]
[null,null,1990,"",null,null,null,"",0]
[null,null,1991,"",null,null,null,"",0]
[null,null,1992,"",null,null,null,"",0]
[null,null,1993,"",null,null,null,"",0]
[null,null,1994,"",null,null,null,"",0]
[null,null,1995,"",null,null,null,"",0]
[null,null,1996,"",null,null,null,"",0]
[null,null,1997,"",null,null,null,"",0]
[null,null,1998,"",null,null,null,"",0]
[null,null,1999,"",null,null,null,"",0]
[null,null,2000,"",null,null,null,"",0]
[null,null,2001,"",null,null,null,"",0]
[null,null,2002,"",null,null,null,"",0]
[null,null,2003,"",null,null,null,"",0]
[null,null,2004,"",null,null,null,"",0]
[null,null,2005,"",null,null,null,"",0]
[null,null,2006,"",null,null,null,"",0]
[null,null,2007,"",null,null,null,"",0]
[null,null,2008,"",null,null,null,"",0]
[null,null,2009,"",null,null,null,"",0]
[null,null,2010,"",null,null,null,"",0]
[null,null,2011,"",null,null,null,"",0]
[null,null,2012,"",null,null,null,"",0]
[null,null,2013,"",null,null,null,"",0]
[null,null,2014,"",null,null,null,"",0]
[null,null,2015,"",null,null,null,"",0]
[null,null,2016,"",null,null,null,"",0]
[null,null,2017,"",null,null,null,"",0]
[null,null,2018,"",null,null,null,"",0]
[null,null,2019,"",null,null,null,"",0]
[null,null,2020,"",null,null,null,"",0]
[null,null,2021,"",null,null,null,"",0]
[null,null,2022,"",null,null,null,"",0]
[null,null,2023,"",null,null,null,"",0]
[null,null,2024,"",null,null,null,"",0]
[null,null,2025,"",null,null,null,"",0]
[null,null,2026,"",null,null,null,"",0]
[null,null,2027,"",null,null,null,"",0]
[null,null,2028,"",null,null,null,"",0]
[null,null,2029,"",null,null,null,"",0]
[null,null,2030,"",null,null,null,"",0]
[null,null,2031,"",null,null,null,"",0]
[null,null,2032,"",null,null,null,"",0]
[null,null,2033,"",null,null,null,"",0]
[null,null,2034,"",null,null,null,"",0]
[null,null,2035,"",null,null,null,"",0]
[null,null,2036,"",null,null,null,"",0]
[null,null,2037,"",null,null,null,"",0]
[null,null,2038,"",null,null,null,"",0]
[null,null,2039,"",null,null,null,"",0]
[null,null,2040,"",null,null,null,"",0]
[null,null,2041,"",null,null,null,"",0]
[null,null,2042,"",null,null,null,"",0]
[null,null,2043,"",null,null,null,"",0]
[null,null,2044,"",null,null,null,"",0]
[null,null,2045,"",null,null,null,"",0]
[null,null,2046,"",null,null,null,"",0]
[null,null,2047,"",null,null,null,"",0]
[null,null,2048,"",null,null,null,"",0]
[null,null,2049,"",null,null,null,"",0]
[null,null,2050,"",null,null,null,"",0]
[null,null,2051,"",null,null,null,"",0]
[null,null,2052,"",null,null,null,"",0]
[null,null,2053,"",null,null,null,"",0]
[null,null,2054,"",null,null,null,"",0]
[null,null,2055,"",null,null,null,"",0]
[null,null,2056,"",null,null,null,"",0]
[null,null,2057,"",null,null,null,"",0]
[null,null,2058,"",null,null,null,"",0]
[null,null,2059,"",null,null,null,"",0]
[null,null,2060,"",null,null,null,"",0]
[null,null,2061,"",null,null,null,"",0]
[null,null,2062,"",null,null,null,"",0]
[null,null,2063,"",null,null,null,"",0]
[null,null,2064,"",null,null,null,"",0]
[null,null,2065,"",null,null,null,"",0]
[null,null,2066,"",null,null,null,"",0]
[null,null,2067,"",null,null,null,"",0]
[null,null,2068,"",null,null,null,"",0]
[null,null,2069,"",null,null,null,"",0]
[null,null,2070,"",null,null,null,"",0]
[null,null,2071,"",null,null,null,"",0]
[null,null,2072,"",null,null,null,"",0]
[null,null,2073,"",null,null,null,"",0]
[null,null,2074,"",null,null,null,"",0]
[null,null,2075,"",null,null,null,"",0]
[null,null,2076,"",null,null,null,"",0]
[null,null,2077,"",null,null,null,"",0]
[null,null,2078,"",null,null,null,"",0]
[null,null,2079,"",null,null,null,"",0]
[null,null,2080,"",null,null,null,"",0]
[null,null,2081,"",null,null,null,"",0]
[null,null,2082,"",null,null,null,"",0]
[null,null,2083,"",null,null,null,"",0]
[null,null,2084,"",null,null,null,"",0]
[null,null,2085,"",null,null,null,"",0]
[null,null,2086,"",null,null,null,"",0]
[null,null,2087,"",null,null,null,"",0]
[null,null,2088,"",null,null,null,"",0]
[null,null,2089,"",null,null,null,"",0]
[null,null,2090,"",null,null,null,"",0]
[null,null,2091,"",null,null,null,"",0]
[null,null,2092,"",null,null,null,"",0]
[null,null,2093,"",null,null,null,"",0]
[null,null,2094,"",null,null,null,"",0]
[null,null,2095,"",null,null,null,"",0]
[null,null,2096,"",null,null,null,"",0]
[null,null,2097,"",null,null,null,"",0]
[null,null,2098,"",null,null,null,"",0]
[null,null,2099,"",null,null,null,"",0]
[null,null,2100,"",null,null,null,"",0]
[null,null,2101,"",null,null,null,"",0]
[null,null,2102,"",null,null,null,"",0]
[null,null,2103,"",null,null,null,"",0]
[null,null,2104,"",null,null,null,"",0]
[null,null,2105,"",null,null,null,"",0]
[null,null,2106,"",null,null,null,"",0]
[null,null,2107,"",null,null,null,"",0]
[null,null,2108,"",null,null,null,"",0]
[null,null,2109,"",null,null,null,"",0]
[null,null,2110,"",null,null,null,"",0]
[null,null,2111,"",null,null,null,"",0]
[null,null,2112,"",null,null,null,"",0]
[null,null,2113,"",null,null,null,"",0]
[null,null,2114,"",null,null,null,"",0]
[null,null,2115,"",null,null,null,"",0]
[null,null,2116,"",null,null,null,"",0]
[null,null,2117,"",null,null,null,"",0]
[null,null,2118,"",null,null,null,"",0]
[null,null,2119,"",null,null,null,"",0]
[null,null,2120,"",null,null,null,"",0]
[null,null,2121,"",null,null,null,"",0]
[null,null,2122,"",null,null,null,"",0]
[null,null,2123,"",null,null,null,"",0]
[null,null,2124,"",null,null,null,"",0]
[null,null,2125,"",null,null,null,"",0]
[null,null,2126,"",null,null,null,"",0]
[null,null,2127,"",null,null,null,"",0]
[null,null,2128,"",null,null,null,"",0]
[null,null,2129,"",null,null,null,"",0]
[null,null,2130,"",null,null,null,"",0]
[null,null,2131,"",null,null,null,"",0]
[null,null,2132,"",null,null,null,"",0]
[null,null,2133,"",null,null,null,"",0]
[null,null,2134,"",null,null,null,"",0]
[null,null,2135,"",null,null,null,"",0]
[null,null,2136,"",null,null,null,"",0]
[null,null,2137,"",null,null,null,"",0]
[null,null,2138,"",null,null,null,"",0]
[null,null,2139,"",null,null,null,"",0]
[null,null,2140,"",null,null,null,"",0]
[null,null,2141,"",null,null,null,"",0]
[null,null,2142,"",null,null,null,"",0]
[null,null,2143,"",null,null,null,"",0]
[null,null,2144,"",null,null,null,"",0]
[null,null,2145,"",null,null,null,"",0]
[null,null,2146,"",null,null,null,"",0]
[null,null,2147,"",null,null,null,"",0]
[null,null,2148,"",null,null,null,"",0]
[null,null,2149,"",null,null,null,"",0]
[null,null,2150,"",null,null,null,"",0]
[null,null,2151,"",null,null,null,"",0]
[null,null,2152,"",null,null,null,"",0]
[null,null,2153,"",null,null,null,"",0]
[null,null,2154,"",null,null,null,"",0]
[null,null,2155,"",null,null,null,"",0]
[null,null,2156,"",null,null,null,"",0]
[null,null,2157,"",null,null,null,"",0]
[null,null,2158,"",null,null,null,"",0]
[null,null,2159,"",null,null,null,"",0]
[null,null,2160,"",null,null,null,"",0]
[null,null,2161,"",null,null,null,"",0]
[null,null,2162,"",null,null,null,"",0]
[null,null,2163,"",null,null,null,"",0]
[null,null,2164,"",null,null,null,"",0]
[null,null,2165,"",null,null,null,"",0]
[null,null,2166,"",null,null,null,"",0]
[null,null,2167,"",null,null,null,"",0]
[null,null,2168,"",null,null,null,"",0]
[null,null,2169,"",null,null,null,"",0]
[null,null,2170,"",null,null,null,"",0]
[null,null,2171,"",null,null,null,"",0]
[null,null,2172,"",null,null,null,"",0]
[null,null,2173,"",null,null,null,"",0]
[null,null,2174,"",null,null,null,"",0]
[null,null,2175,"",null,null,null,"",0]
[null,null,2176,"",null,null,null,"",0]
[null,null,2177,"",null,null,null,"",0]
[null,null,2178,"",null,null,null,"",0]
[null,null,2179,"",null,null,null,"",0]
[null,null,2180,"",null,null,null,"",0]
[null,null,2181,"",null,null,null,"",0]
[null,null,2182,"",null,null,null,"",0]
[null,null,2183,"",null,null,null,"",0]
[null,null,2184,"",null,null,null,"",0]
[null,null,2185,"",null,null,null,"",0]
[null,null,2186,"",null,null,null,"",0]
[null,null,2187,"",null,null,null,"",0]
[null,null,2188,"",null,null,null,"",0]
[null,null,2189,"",null,null,null,"",0]
[null,null,2190,"",null,null,null,"",0]
[null,null,2191,"",null,null,null,"",0]
[null,null,2192,"",null,null,null,"",0]
[null,null,2193,"",null,null,null,"",0]
[null,null,2194,"",null,null,null,"",0]
[null,null,2195,"",null,null,null,"",0]
[null,null,2196,"",null,null,null,"",0]
[null,null,2197,"",null,null,null,"",0]
[null,null,2198,"",null,null,null,"",0]
[null,null,2199,"",null,null,null,"",0]
[null,null,2200,"",null,null,null,"",0]
[null,null,2201,"",null,null,null,"",0]
[null,null,2202,"",null,null,null,"",0]
[null,null,2203,"",null,null,null,"",0]
[null,null,2204,"",null,null,null,"",0]
[null,null,2205,"",null,null,null,"",0]
[null,null,2206,"",null,null,null,"",0]
[null,null,2207,"",null,null,null,"",0]
[null,null,2208,"",null,null,null,"",0]
[null,null,2209,"",null,null,null,"",0]
[null,null,2210,"",null,null,null,"",0]
[null,null,2211,"",null,null,null,"",0]
[null,null,2212,"",null,null,null,"",0]
[null,null,2213,"",null,null,null,"",0]
[null,null,2214,"",null,null,null,"",0]
[null,null,2215,"",null,null,null,"",0]
[null,null,2216,"",null,null,null,"",0]
[null,null,2217,"",null,null,null,"",0]
[null,null,2218,"",null,null,null,"",0]
[null,null,2219,"",null,null,null,"",0]
[null,null,2220,"",null,null,null,"",0]
[null,null,2221,"",null,null,null,"",0]
[null,null,2222,"",null,null,null,"",0]
[null,null,2223,"",null,null,null,"",0]
[null,null,2224,"",null,null,null,"",0]
[null,null,2225,"",null,null,null,"",0]
[null,null,2226,"",null,null,null,"",0]
[null,null,2227,"",null,null,null,"",0]
[null,null,2228,"",null,null,null,"",0]
[null,null,2229,"",null,null,null,"",0]
[null,null,2230,"",null,null,null,"",0]
[null,null,2231,"",null,null,null,"",0]
[null,null,2232,"",null,null,null,"",0]
[null,null,2233,"",null,null,null,"",0]
[null,null,2234,"",null,null,null,"",0]
[null,null,2235,"",null,null,null,"",0]
[null,null,2236,"",null,null,null,"",0]
[null,null,2237,"",null,null,null,"",0]
[null,null,2238,"",null,null,null,"",0]
[null,null,2239,"",null,null,null,"",0]
[null,null,2240,"",null,null,null,"",0]
[null,null,2241,"",null,null,null,"",0]
[null,null,2242,"",null,null,null,"",0]
[null,null,2243,"",null,null,null,"",0]
[null,null,2244,"",null,null,null,"",0]
[null,null,2245,"",null,null,null,"",0]
[null,null,2246,"",null,null,null,"",0]
[null,null,2247,"",null,null,null,"",0]
[null,null,2248,"",null,null,null,"",0]
[null,null,2249,"",null,null,null,"",0]
[null,null,2250,"",null,null,null,"",0]
[null,null,2251,"",null,null,null,"",0]
[null,null,2252,"",null,null,null,"",0]
[null,null,2253,"",null,null,null,"",0]
[null,null,2254,"",null,null,null,"",0]
[null,null,2255,"",null,null,null,"",0]
[null,null,2256,"",null,null,null,"",0]
[null,null,2257,"",null,null,null,"",0]
[null,null,2258,"",null,null,null,"",0]
[null,null,2259,"",null,null,null,"",0]
[null,null,2260,"",null,null,null,"",0]
[null,null,2261,"",null,null,null,"",0]
[null,null,2262,"",null,null,null,"",0]
[null,null,2263,"",null,null,null,"",0]
[null,null,2264,"",null,null,null,"",0]
[null,null,2265,"",null,null,null,"",0]
[null,null,2266,"",null,null,null,"",0]
[null,null,2267,"",null,null,null,"",0]
[null,null,2268,"",null,null,null,"",0]
[null,null,2269,"",null,null,null,"",0]
[null,null,2270,"",null,null,null,"",0]
[null,null,2271,"",null,null,null,"",0]
[null,null,2272,"",null,null,null,"",0]
[null,null,2273,"",null,null,null,"",0]
[null,null,2274,"",null,null,null,"",0]
[null,null,2275,"",null,null,null,"",0]
[null,null,2276,"",null,null,null,"",0]
[null,null,2277,"",null,null,null,"",0]
[null,null,2278,"",null,null,null,"",0]
[null,null,2279,"",null,null,null,"",0]
[null,null,2280,"",null,null,null,"",0]
[null,null,2281,"",null,null,null,"",0]
[null,null,2282,"",null,null,null,"",0]
[null,null,2283,"",null,null,null,"",0]
[null,null,2284,"",null,null,null,"",0]
[null,null,2285,"",null,null,null,"",0]
[null,null,2286,"",null,null,null,"",0]
[null,null,2287,"",null,null,null,"",0]
[null,null,2288,"",null,null,null,"",0]
[null,null,2289,"",null,null,null,"",0]
[null,null,2290,"",null,null,null,"",0]
[null,null,2291,"",null,null,null,"",0]
[null,null,2292,"",null,null,null,"",0]
[null,null,2293,"",null,null,null,"",0]
[null,null,2294,"",null,null,null,"",0]
[null,null,2295,"",null,null,null,"",0]
[null,null,2296,"",null,null,null,"",0]
[null,null,2297,"",null,null,null,"",0]
[null,null,2298,"",null,null,null,"",0]
[null,null,2299,"",null,null,null,"",0]
[null,null,2300,"",null,null,null,"",0]
[null,null,2301,"",null,null,null,"",0]
[null,null,2302,"",null,null,null,"",0]
[null,null,2303,"",null,null,null,"",0]
[null,null,2304,"",null,null,null,"",0]
[null,null,2305,"",null,null,null,"",0]
[null,null,2306,"",null,null,null,"",0]
[null,null,2307,"",null,null,null,"",0]
[null,null,2308,"",null,null,null,"",0]
[null,null,2309,"",null,null,null,"",0]
[null,null,2310,"",null,null,null,"",0]
[null,null,2311,"",null,null,null,"",0]
[null,null,2312,"",null,null,null,"",0]
[null,null,2313,"",null,null,null,"",0]
[null,null,2314,"",null,null,null,"",0]
[null,null,2315,"",null,null,null,"",0]
[null,null,2316,"",null,null,null,"",0]
[null,null,2317,"",null,null,null,"",0]
[null,null,2318,"",null,null,null,"",0]
[null,null,2319,"",null,null,null,"",0]
[null,null,2320,"",null,null,null,"",0]
[null,null,2321,"",null,null,null,"",0]
[null,null,2322,"",null,null,null,"",0]
[null,null,2323,"",null,null,null,"",0]
[null,null,2324,"",null,null,null,"",0]
[null,null,2325,"",null,null,null,"",0]
[null,null,2326,"",null,null,null,"",0]
[null,null,2327,"",null,null,null,"",0]
[null,null,2328,"",null,null,null,"",0]
[null,null,2329,"",null,null,null,"",0]
[null,null,2330,"",null,null,null,"",0]
[null,null,2331,"",null,null,null,"",0]
[null,null,2332,"",null,null,null,"",0]
[null,null,2333,"",null,null,null,"",0]
[null,null,2334,"",null,null,null,"",0]
[null,null,2335,"",null,null,null,"",0]
[null,null,2336,"",null,null,null,"",0]
[null,null,2337,"",null,null,null,"",0]
[null,null,2338,"",null,null,null,"",0]
[null,null,2339,"",null,null,null,"",0]
[null,null,2340,"",null,null,null,"",0]
[null,null,2341,"",null,null,null,"",0]
[null,null,2342,"",null,null,null,"",0]
[null,null,2343,"",null,null,null,"",0]
[null,null,2344,"",null,null,null,"",0]
[null,null,2345,"",null,null,null,"",0]
[null,null,2346,"",null,null,null,"",0]
[null,null,2347,"",null,null,null,"",0]
[null,null,2348,"",null,null,null,"",0]
[null,null,2349,"",null,null,null,"",0]
[null,null,2350,"",null,null,null,"",0]
[null,null,2351,"",null,null,null,"",0]
[null,null,2352,"",null,null,null,"",0]
[null,null,2353,"",null,null,null,"",0]
[null,null,2354,"",null,null,null,"",0]
[null,null,2355,"",null,null,null,"",0]
[null,null,2356,"",null,null,null,"",0]
[null,null,2357,"",null,null,null,"",0]
[null,null,2358,"",null,null,null,"",0]
[null,null,2359,"",null,null,null,"",0]
[null,null,2360,"",null,null,null,"",0]
[null,null,2361,"",null,null,null,"",0]
[null,null,2362,"",null,null,null,"",0]
[null,null,2363,"",null,null,null,"",0]
[null,null,2364,"",null,null,null,"",0]
[null,null,2365,"",null,null,null,"",0]
[null,null,2366,"",null,null,null,"",0]
[null,null,2367,"",null,null,null,"",0]
[null,null,2368,"",null,null,null,"",0]
[null,null,2369,"",null,null,null,"",0]
[null,null,2370,"",null,null,null,"",0]
[null,null,2371,"",null,null,null,"",0]
[null,null,2372,"",null,null,null,"",0]
[null,null,2373,"",null,null,null,"",0]
[null,null,2374,"",null,null,null,"",0]
[null,null,2375,"",null,null,null,"",0]
[null,null,2376,"",null,null,null,"",0]
[null,null,2377,"",null,null,null,"",0]
[null,null,2378,"",null,null,null,"",0]
[null,null,2379,"",null,null,null,"",0]
[null,null,2380,"",null,null,null,"",0]
[null,null,2381,"",null,null,null,"",0]
[null,null,2382,"",null,null,null,"",0]
[null,null,2383,"",null,null,null,"",0]
[null,null,2384,"",null,null,null,"",0]
[null,null,2385,"",null,null,null,"",0]
[null,null,2386,"",null,null,null,"",0]
[null,null,2387,"",null,null,null,"",0]
[null,null,2388,"",null,null,null,"",0]
[null,null,2389,"",null,null,null,"",0]
[null,null,2390,"",null,null,null,"",0]
[null,null,2391,"",null,null,null,"",0]
[null,null,2392,"",null,null,null,"",0]
[null,null,2393,"",null,null,null,"",0]
[null,null,2394,"",null,null,null,"",0]
[null,null,2395,"",null,null,null,"",0]
[null,null,2396,"",null,null,null,"",0]
[null,null,2397,"",null,null,null,"",0]
[null,null,2398,"",null,null,null,"",0]
[null,null,2399,"",null,null,null,"",0]
[null,null,2400,"",null,null,null,"",0]
[null,null,2401,"",null,null,null,"",0]
[null,null,2402,"",null,null,null,"",0]
[null,null,2403,"",null,null,null,"",0]
[null,null,2404,"",null,null,null,"",0]
[null,null,2405,"",null,null,null,"",0]
[null,null,2406,"",null,null,null,"",0]
[null,null,2407,"",null,null,null,"",0]
[null,null,2408,"",null,null,null,"",0]
[null,null,2409,"",null,null,null,"",0]
[null,null,2410,"",null,null,null,"",0]
[null,null,2411,"",null,null,null,"",0]
[null,null,2412,"",null,null,null,"",0]
[null,null,2413,"",null,null,null,"",0]
[null,null,2414,"",null,null,null,"",0]
[null,null,2415,"",null,null,null,"",0]
[null,null,2416,"",null,null,null,"",0]
[null,null,2417,"",null,null,null,"",0]
[null,null,2418,"",null,null,null,"",0]
[null,null,2419,"",null,null,null,"",0]
[null,null,2420,"",null,null,null,"",0]
[null,null,2421,"",null,null,null,"",0]
[null,null,2422,"",null,null,null,"",0]
[null,null,2423,"",null,null,null,"",0]
[null,null,2424,"",null,null,null,"",0]
[null,null,2425,"",null,null,null,"",0]
[null,null,2426,"",null,null,null,"",0]
[null,null,2427,"",null,null,null,"",0]
[null,null,2428,"",null,null,null,"",0]
[null,null,2429,"",null,null,null,"",0]
[null,null,2430,"",null,null,null,"",0]
[null,null,2431,"",null,null,null,"",0]
[null,null,2432,"",null,null,null,"",0]
[null,null,2433,"",null,null,null,"",0]
[null,null,2434,"",null,null,null,"",0]
[null,null,2435,"",null,null,null,"",0]
[null,null,2436,"",null,null,null,"",0]
[null,null,2437,"",null,null,null,"",0]
[null,null,2438,"",null,null,null,"",0]
[null,null,2439,"",null,null,null,"",0]
[null,null,2440,"",null,null,null,"",0]
[null,null,2441,"",null,null,null,"",0]
[null,null,2442,"",null,null,null,"",0]
[null,null,2443,"",null,null,null,"",0]
[null,null,2444,"",null,null,null,"",0]
[null,null,2445,"",null,null,null,"",0]
[null,null,2446,"",null,null,null,"",0]
[null,null,2447,"",null,null,null,"",0]
[null,null,2448,"",null,null,null,"",0]
[null,null,2449,"",null,null,null,"",0]
[null,null,2450,"",null,null,null,"",0]
[null,null,2451,"",null,null,null,"",0]
[null,null,2452,"",null,null,null,"",0]
[null,null,2453,"",null,null,null,"",0]
[null,null,2454,"",null,null,null,"",0]
[null,null,2455,"",null,null,null,"",0]
[null,null,2456,"",null,null,null,"",0]
[null,null,2457,"",null,null,null,"",0]
[null,null,2458,"",null,null,null,"",0]
[null,null,2459,"",null,null,null,"",0]
[null,null,2460,"",null,null,null,"",0]
[null,null,2461,"",null,null,null,"",0]
[null,null,2462,"",null,null,null,"",0]
[null,null,2463,"",null,null,null,"",0]
[null,null,2464,"",null,null,null,"",0]
[null,null,2465,"",null,null,null,"",0]
[null,null,2466,"",null,null,null,"",0]
[null,null,2467,"",null,null,null,"",0]
[null,null,2468,"",null,null,null,"",0]
[null,null,2469,"",null,null,null,"",0]
[null,null,2470,"",null,null,null,"",0]
[null,null,2471,"",null,null,null,"",0]
[null,null,2472,"",null,null,null,"",0]
[null,null,2473,"",null,null,null,"",0]
[null,null,2474,"",null,null,null,"",0]
[null,null,2475,"",null,null,null,"",0]
[null,null,2476,"",null,null,null,"",0]
[null,null,2477,"",null,null,null,"",0]
[null,null,2478,"",null,null,null,"",0]
[null,null,2479,"",null,null,null,"",0]
[null,null,2480,"",null,null,null,"",0]
[null,null,2481,"",null,null,null,"",0]
[null,null,2482,"",null,null,null,"",0]
[null,null,2483,"",null,null,null,"",0]
[null,null,2484,"",null,null,null,"",0]
[null,null,2485,"",null,null,null,"",0]
[null,null,2486,"",null,null,null,"",0]
[null,null,2487,"",null,null,null,"",0]
[null,null,2488,"",null,null,null,"",0]
[null,null,2489,"",null,null,null,"",0]
[null,null,2490,"",null,null,null,"",0]
[null,null,2491,"",null,null,null,"",0]
[null,null,2492,"",null,null,null,"",0]
[null,null,2493,"",null,null,null,"",0]
[null,null,2494,"",null,null,null,"",0]
[null,null,2495,"",null,null,null,"",0]
[null,null,2496,"",null,null,null,"",0]
[null,null,2497,"",null,null,null,"",0]
[null,null,2498,"",null,null,null,"",0]
[null,null,2499,"",null,null,null,"",0]
[null,null,2500,"",null,null,null,"",0]
[null,null,2501,"",null,null,null,"",0]
[null,null,2502,"",null,null,null,"",0]
[null,null,2503,"",null,null,null,"",0]
[null,null,2504,"",null,null,null,"",0]
[null,null,2505,"",null,null,null,"",0]
[null,null,2506,"",null,null,null,"",0]
[null,null,2507,"",null,null,null,"",0]
[null,null,2508,"",null,null,null,"",0]
[null,null,2509,"",null,null,null,"",0]
[null,null,2510,"",null,null,null,"",0]
[null,null,2511,"",null,null,null,"",0]
[null,null,2512,"",null,null,null,"",0]
[null,null,2513,"",null,null,null,"",0]
[null,null,2514,"",null,null,null,"",0]
[null,null,2515,"",null,null,null,"",0]
[null,null,2516,"",null,null,null,"",0]
[null,null,2517,"",null,null,null,"",0]
[null,null,2518,"",null,null,null,"",0]
[null,null,2519,"",null,null,null,"",0]
[null,null,2520,"",null,null,null,"",0]
[null,null,2521,"",null,null,null,"",0]
[null,null,2522,"",null,null,null,"",0]
[null,null,2523,"",null,null,null,"",0]
[null,null,2524,"",null,null,null,"",0]
[null,null,2525,"",null,null,null,"",0]
[null,null,2526,"",null,null,null,"",0]
[null,null,2527,"",null,null,null,"",0]
[null,null,2528,"",null,null,null,"",0]
[null,null,2529,"",null,null,null,"",0]
[null,null,2530,"",null,null,null,"",0]
[null,null,2531,"",null,null,null,"",0]
[null,null,2532,"",null,null,null,"",0]
[null,null,2533,"",null,null,null,"",0]
[null,null,2534,"",null,null,null,"",0]
[null,null,2535,"",null,null,null,"",0]
[null,null,2536,"",null,null,null,"",0]
[null,null,2537,"",null,null,null,"",0]
[null,null,2538,"",null,null,null,"",0]
[null,null,2539,"",null,null,null,"",0]
[null,null,2540,"",null,null,null,"",0]
[null,null,2541,"",null,null,null,"",0]
[null,null,2542,"",null,null,null,"",0]
[null,null,2543,"",null,null,null,"",0]
[null,null,2544,"",null,null,null,"",0]
[null,null,2545,"",null,null,null,"",0]
[null,null,2546,"",null,null,null,"",0]
[null,null,2547,"",null,null,null,"",0]
[null,null,2548,"",null,null,null,"",0]
[null,null,2549,"",null,null,null,"",0]
[null,null,2550,"",null,null,null,"",0]
[null,null,2551,"",null,null,null,"",0]
[null,null,2552,"",null,null,null,"",0]
[null,null,2553,"",null,null,null,"",0]
[null,null,2554,"",null,null,null,"",0]
[null,null,2555,"",null,null,null,"",0]
[null,null,2556,"",null,null,null,"",0]
[null,null,2557,"",null,null,null,"",0]
[null,null,2558,"",null,null,null,"",0]
[null,null,2559,"",null,null,null,"",0]
[null,null,2560,"",null,null,null,"",0]
[null,null,2561,"",null,null,null,"",0]
[null,null,2562,"",null,null,null,"",0]
[null,null,2563,"",null,null,null,"",0]
[null,null,2564,"",null,null,null,"",0]
[null,null,2565,"",null,null,null,"",0]
[null,null,2566,"",null,null,null,"",0]
[null,null,2567,"",null,null,null,"",0]
[null,null,2568,"",null,null,null,"",0]
[null,null,2569,"",null,null,null,"",0]
[null,null,2570,"",null,null,null,"",0]
[null,null,2571,"",null,null,null,"",0]
[null,null,2572,"",null,null,null,"",0]
[null,null,2573,"",null,null,null,"",0]
[null,null,2574,"",null,null,null,"",0]
[null,null,2575,"",null,null,null,"",0]
[null,null,2576,"",null,null,null,"",0]
[null,null,2577,"",null,null,null,"",0]
[null,null,2578,"",null,null,null,"",0]
[null,null,2579,"",null,null,null,"",0]
[null,null,2580,"",null,null,null,"",0]
[null,null,2581,"",null,null,null,"",0]
[null,null,2582,"",null,null,null,"",0]
[null,null,2583,"",null,null,null,"",0]
[null,null,2584,"",null,null,null,"",0]
[null,null,2585,"",null,null,null,"",0]
[null,null,2586,"",null,null,null,"",0]
[null,null,2587,"",null,null,null,"",0]
[null,null,2588,"",null,null,null,"",0]
[null,null,2589,"",null,null,null,"",0]
[null,null,2590,"",null,null,null,"",0]
[null,null,2591,"",null,null,null,"",0]
[null,null,2592,"",null,null,null,"",0]
[null,null,2593,"",null,null,null,"",0]
[null,null,2594,"",null,null,null,"",0]
[null,null,2595,"",null,null,null,"",0]
[null,null,2596,"",null,null,null,"",0]
[null,null,2597,"",null,null,null,"",0]
[null,null,2598,"",null,null,null,"",0]
[null,null,2599,"",null,null,null,"",0]
[null,null,2600,"",null,null,null,"",0]
[null,null,2601,"",null,null,null,"",0]
[null,null,2602,"",null,null,null,"",0]
[null,null,2603,"",null,null,null,"",0]
[null,null,2604,"",null,null,null,"",0]
[null,null,2605,"",null,null,null,"",0]
[null,null,2606,"",null,null,null,"",0]
[null,null,2607,"",null,null,null,"",0]
[null,null,2608,"",null,null,null,"",0]
[null,null,2609,"",null,null,null,"",0]
[null,null,2610,"",null,null,null,"",0]
[null,null,2611,"",null,null,null,"",0]
[null,null,2612,"",null,null,null,"",0]
[null,null,2613,"",null,null,null,"",0]
[null,null,2614,"",null,null,null,"",0]
[null,null,2615,"",null,null,null,"",0]
[null,null,2616,"",null,null,null,"",0]
[null,null,2617,"",null,null,null,"",0]
[null,null,2618,"",null,null,null,"",0]
[null,null,2619,"",null,null,null,"",0]
[null,null,2620,"",null,null,null,"",0]
[null,null,2621,"",null,null,null,"",0]
[null,null,2622,"",null,null,null,"",0]
[null,null,2623,"",null,null,null,"",0]
[null,null,2624,"",null,null,null,"",0]
[null,null,2625,"",null,null,null,"",0]
[null,null,2626,"",null,null,null,"",0]
[null,null,2627,"",null,null,null,"",0]
[null,null,2628,"",null,null,null,"",0]
[null,null,2629,"",null,null,null,"",0]
[null,null,2630,"",null,null,null,"",0]
[null,null,2631,"",null,null,null,"",0]
[null,null,2632,"",null,null,null,"",0]
[null,null,2633,"",null,null,null,"",0]
[null,null,2634,"",null,null,null,"",0]
[null,null,2635,"",null,null,null,"",0]
[null,null,2636,"",null,null,null,"",0]
[null,null,2637,"",null,null,null,"",0]
[null,null,2638,"",null,null,null,"",0]
[null,null,2639,"",null,null,null,"",0]
[null,null,2640,"",null,null,null,"",0]
[null,null,2641,"",null,null,null,"",0]
[null,null,2642,"",null,null,null,"",0]
[null,null,2643,"",null,null,null,"",0]
[null,null,2644,"",null,null,null,"",0]
[null,null,2645,"",null,null,null,"",0]
[null,null,2646,"",null,null,null,"",0]
[null,null,2647,"",null,null,null,"",0]
[null,null,2648,"",null,null,null,"",0]
[null,null,2649,"",null,null,null,"",0]
[null,null,2650,"",null,null,null,"",0]
[null,null,2651,"",null,null,null,"",0]
[null,null,2652,"",null,null,null,"",0]
[null,null,2653,"",null,null,null,"",0]
[null,null,2654,"",null,null,null,"",0]
[null,null,2655,"",null,null,null,"",0]
[null,null,2656,"",null,null,null,"",0]
[null,null,2657,"",null,null,null,"",0]
[null,null,2658,"",null,null,null,"",0]
[null,null,2659,"",null,null,null,"",0]
[null,null,2660,"",null,null,null,"",0]
[null,null,2661,"",null,null,null,"",0]
[null,null,2662,"",null,null,null,"",0]
[null,null,2663,"",null,null,null,"",0]
[null,null,2664,"",null,null,null,"",0]
[null,null,2665,"",null,null,null,"",0]
[null,null,2666,"",null,null,null,"",0]
[null,null,2667,"",null,null,null,"",0]
[null,null,2668,"",null,null,null,"",0]
[null,null,2669,"",null,null,null,"",0]
[null,null,2670,"",null,null,null,"",0]
[null,null,2671,"",null,null,null,"",0]
[null,null,2672,"",null,null,null,"",0]
[null,null,2673,"",null,null,null,"",0]
[null,null,2674,"",null,null,null,"",0]
[null,null,2675,"",null,null,null,"",0]
[null,null,2676,"",null,null,null,"",0]
[null,null,2677,"",null,null,null,"",0]
[null,null,2678,"",null,null,null,"",0]
[null,null,2679,"",null,null,null,"",0]
[null,null,2680,"",null,null,null,"",0]
[null,null,2681,"",null,null,null,"",0]
[null,null,2682,"",null,null,null,"",0]
[null,null,2683,"",null,null,null,"",0]
[null,null,2684,"",null,null,null,"",0]
[null,null,2685,"",null,null,null,"",0]
[null,null,2686,"",null,null,null,"",0]
[null,null,2687,"",null,null,null,"",0]
[null,null,2688,"",null,null,null,"",0]
[null,null,2689,"",null,null,null,"",0]
[null,null,2690,"",null,null,null,"",0]
[null,null,2691,"",null,null,null,"",0]
[null,null,2692,"",null,null,null,"",0]
[null,null,2693,"",null,null,null,"",0]
[null,null,2694,"",null,null,null,"",0]
[null,null,2695,"",null,null,null,"",0]
[null,null,2696,"",null,null,null,"",0]
[null,null,2697,"",null,null,null,"",0]
[null,null,2698,"",null,null,null,"",0]
[null,null,2699,"",null,null,null,"",0]
[null,null,2700,"",null,null,null,"",0]
[null,null,2701,"",null,null,null,"",0]
[null,null,2702,"",null,null,null,"",0]
[null,null,2703,"",null,null,null,"",0]
[null,null,2704,"",null,null,null,"",0]
[null,null,2705,"",null,null,null,"",0]
[null,null,2706,"",null,null,null,"",0]
[null,null,2707,"",null,null,null,"",0]
[null,null,2708,"",null,null,null,"",0]
[null,null,2709,"",null,null,null,"",0]
[null,null,2710,"",null,null,null,"",0]
[null,null,2711,"",null,null,null,"",0]
[null,null,2712,"",null,null,null,"",0]
[null,null,2713,"",null,null,null,"",0]
[null,null,2714,"",null,null,null,"",0]
[null,null,2715,"",null,null,null,"",0]
[null,null,2716,"",null,null,null,"",0]
[null,null,2717,"",null,null,null,"",0]
[null,null,2718,"",null,null,null,"",0]
[null,null,2719,"",null,null,null,"",0]
[null,null,2720,"",null,null,null,"",0]
[null,null,2721,"",null,null,null,"",0]
[null,null,2722,"",null,null,null,"",0]
[null,null,2723,"",null,null,null,"",0]
[null,null,2724,"",null,null,null,"",0]
[null,null,2725,"",null,null,null,"",0]
[null,null,2726,"",null,null,null,"",0]
[null,null,2727,"",null,null,null,"",0]
[null,null,2728,"",null,null,null,"",0]
[null,null,2729,"",null,null,null,"",0]
[null,null,2730,"",null,null,null,"",0]
[null,null,2731,"",null,null,null,"",0]
[null,null,2732,"",null,null,null,"",0]
[null,null,2733,"",null,null,null,"",0]
[null,null,2734,"",null,null,null,"",0]
[null,null,2735,"",null,null,null,"",0]
[null,null,2736,"",null,null,null,"",0]
[null,null,2737,"",null,null,null,"",0]
[null,null,2738,"",null,null,null,"",0]
[null,null,2739,"",null,null,null,"",0]
[null,null,2740,"",null,null,null,"",0]
[null,null,2741,"",null,null,null,"",0]
[null,null,2742,"",null,null,null,"",0]
[null,null,2743,"",null,null,null,"",0]
[null,null,2744,"",null,null,null,"",0]
[null,null,2745,"",null,null,null,"",0]
[null,null,2746,"",null,null,null,"",0]
[null,null,2747,"",null,null,null,"",0]
[null,null,2748,"",null,null,null,"",0]
[null,null,2749,"",null,null,null,"",0]
[null,null,2750,"",null,null,null,"",0]
[null,null,2751,"",null,null,null,"",0]
[null,null,2752,"",null,null,null,"",0]
[null,null,2753,"",null,null,null,"",0]
[null,null,2754,"",null,null,null,"",0]
[null,null,2755,"",null,null,null,"",0]
[null,null,2756,"",null,null,null,"",0]
[null,null,2757,"",null,null,null,"",0]
[null,null,2758,"",null,null,null,"",0]
[null,null,2759,"",null,null,null,"",0]
[null,null,2760,"",null,null,null,"",0]
[null,null,2761,"",null,null,null,"",0]
[null,null,2762,"",null,null,null,"",0]
[null,null,2763,"",null,null,null,"",0]
[null,null,2764,"",null,null,null,"",0]
[null,null,2765,"",null,null,null,"",0]
[null,null,2766,"",null,null,null,"",0]
[null,null,2767,"",null,null,null,"",0]
[null,null,2768,"",null,null,null,"",0]
[null,null,2769,"",null,null,null,"",0]
[null,null,2770,"",null,null,null,"",0]
[null,null,2771,"",null,null,null,"",0]
[null,null,2772,"",null,null,null,"",0]
[null,null,2773,"",null,null,null,"",0]
[null,null,2774,"",null,null,null,"",0]
[null,null,2775,"",null,null,null,"",0]
[null,null,2776,"",null,null,null,"",0]
[null,null,2777,"",null,null,null,"",0]
[null,null,2778,"",null,null,null,"",0]
[null,null,2779,"",null,null,null,"",0]
[null,null,2780,"",null,null,null,"",0]
[null,null,2781,"",null,null,null,"",0]
[null,null,2782,"",null,null,null,"",0]
[null,null,2783,"",null,null,null,"",0]
[null,null,2784,"",null,null,null,"",0]
[null,null,2785,"",null,null,null,"",0]
[null,null,2786,"",null,null,null,"",0]
[null,null,2787,"",null,null,null,"",0]
[null,null,2788,"",null,null,null,"",0]
[null,null,2789,"",null,null,null,"",0]
[null,null,2790,"",null,null,null,"",0]
[null,null,2791,"",null,null,null,"",0]
[null,null,2792,"",null,null,null,"",0]
[null,null,2793,"",null,null,null,"",0]
[null,null,2794,"",null,null,null,"",0]
[null,null,2795,"",null,null,null,"",0]
[null,null,2796,"",null,null,null,"",0]
[null,null,2797,"",null,null,null,"",0]
[null,null,2798,"",null,null,null,"",0]
[null,null,2799,"",null,null,null,"",0]
[null,null,2800,"",null,null,null,"",0]
[null,null,2801,"",null,null,null,"",0]
[null,null,2802,"",null,null,null,"",0]
[null,null,2803,"",null,null,null,"",0]
[null,null,2804,"",null,null,null,"",0]
[null,null,2805,"",null,null,null,"",0]
[null,null,2806,"",null,null,null,"",0]
[null,null,2807,"",null,null,null,"",0]
[null,null,2808,"",null,null,null,"",0]
[null,null,2809,"",null,null,null,"",0]
[null,null,2810,"",null,null,null,"",0]
[null,null,2811,"",null,null,null,"",0]
[null,null,2812,"",null,null,null,"",0]
[null,null,2813,"",null,null,null,"",0]
[null,null,2814,"",null,null,null,"",0]
[null,null,2815,"",null,null,null,"",0]
[null,null,2816,"",null,null,null,"",0]
[null,null,2817,"",null,null,null,"",0]
[null,null,2818,"",null,null,null,"",0]
[null,null,2819,"",null,null,null,"",0]
[null,null,2820,"",null,null,null,"",0]
[null,null,2821,"",null,null,null,"",0]
[null,null,2822,"",null,null,null,"",0]
[null,null,2823,"",null,null,null,"",0]
[null,null,2824,"",null,null,null,"",0]
[null,null,2825,"",null,null,null,"",0]
[null,null,2826,"",null,null,null,"",0]
[null,null,2827,"",null,null,null,"",0]
[null,null,2828,"",null,null,null,"",0]
[null,null,2829,"",null,null,null,"",0]
[null,null,2830,"",null,null,null,"",0]
[null,null,2831,"",null,null,null,"",0]
[null,null,2832,"",null,null,null,"",0]
[null,null,2833,"",null,null,null,"",0]
[null,null,2834,"",null,null,null,"",0]
[null,null,2835,"",null,null,null,"",0]
[null,null,2836,"",null,null,null,"",0]
[null,null,2837,"",null,null,null,"",0]
[null,null,2838,"",null,null,null,"",0]
[null,null,2839,"",null,null,null,"",0]
[null,null,2840,"",null,null,null,"",0]
[null,null,2841,"",null,null,null,"",0]
[null,null,2842,"",null,null,null,"",0]
[null,null,2843,"",null,null,null,"",0]
[null,null,2844,"",null,null,null,"",0]
[null,null,2845,"",null,null,null,"",0]
[null,null,2846,"",null,null,null,"",0]
[null,null,2847,"",null,null,null,"",0]
[null,null,2848,"",null,null,null,"",0]
[null,null,2849,"",null,null,null,"",0]
[null,null,2850,"",null,null,null,"",0]
[null,null,2851,"",null,null,null,"",0]
[null,null,2852,"",null,null,null,"",0]
[null,null,2853,"",null,null,null,"",0]
[null,null,2854,"",null,null,null,"",0]
[null,null,2855,"",null,null,null,"",0]
[null,null,2856,"",null,null,null,"",0]
[null,null,2857,"",null,null,null,"",0]
[null,null,2858,"",null,null,null,"",0]
[null,null,2859,"",null,null,null,"",0]
[null,null,2860,"",null,null,null,"",0]
[null,null,2861,"",null,null,null,"",0]
[null,null,2862,"",null,null,null,"",0]
[null,null,2863,"",null,null,null,"",0]
[null,null,2864,"",null,null,null,"",0]
[null,null,2865,"",null,null,null,"",0]
[null,null,2866,"",null,null,null,"",0]
[null,null,2867,"",null,null,null,"",0]
[null,null,2868,"",null,null,null,"",0]
[null,null,2869,"",null,null,null,"",0]
[null,null,2870,"",null,null,null,"",0]
[null,null,2871,"",null,null,null,"",0]
[null,null,2872,"",null,null,null,"",0]
[null,null,2873,"",null,null,null,"",0]
[null,null,2874,"",null,null,null,"",0]
[null,null,2875,"",null,null,null,"",0]
[null,null,2876,"",null,null,null,"",0]
[null,null,2877,"",null,null,null,"",0]
[null,null,2878,"",null,null,null,"",0]
[null,null,2879,"",null,null,null,"",0]
[null,null,2880,"",null,null,null,"",0]
[null,null,2881,"",null,null,null,"",0]
[null,null,2882,"",null,null,null,"",0]
[null,null,2883,"",null,null,null,"",0]
[null,null,2884,"",null,null,null,"",0]
[null,null,2885,"",null,null,null,"",0]
[null,null,2886,"",null,null,null,"",0]
[null,null,2887,"",null,null,null,"",0]
[null,null,2888,"",null,null,null,"",0]
[null,null,2889,"",null,null,null,"",0]
[null,null,2890,"",null,null,null,"",0]
[null,null,2891,"",null,null,null,"",0]
[null,null,2892,"",null,null,null,"",0]
[null,null,2893,"",null,null,null,"",0]
[null,null,2894,"",null,null,null,"",0]
[null,null,2895,"",null,null,null,"",0]
[null,null,2896,"",null,null,null,"",0]
[null,null,2897,"",null,null,null,"",0]
[null,null,2898,"",null,null,null,"",0]
[null,null,2899,"",null,null,null,"",0]
[null,null,2900,"",null,null,null,"",0]
[null,null,2901,"",null,null,null,"",0]
[null,null,2902,"",null,null,null,"",0]
[null,null,2903,"",null,null,null,"",0]
[null,null,2904,"",null,null,null,"",0]
[null,null,2905,"",null,null,null,"",0]
[null,null,2906,"",null,null,null,"",0]
[null,null,2907,"",null,null,null,"",0]
[null,null,2908,"",null,null,null,"",0]
[null,null,2909,"",null,null,null,"",0]
[null,null,2910,"",null,null,null,"",0]
[null,null,2911,"",null,null,null,"",0]
[null,null,2912,"",null,null,null,"",0]
[null,null,2913,"",null,null,null,"",0]
[null,null,2914,"",null,null,null,"",0]
[null,null,2915,"",null,null,null,"",0]
[null,null,2916,"",null,null,null,"",0]
[null,null,2917,"",null,null,null,"",0]
[null,null,2918,"",null,null,null,"",0]
[null,null,2919,"",null,null,null,"",0]
[null,null,2920,"",null,null,null,"",0]
[null,null,2921,"",null,null,null,"",0]
[null,null,2922,"",null,null,null,"",0]
[null,null,2923,"",null,null,null,"",0]
[null,null,2924,"",null,null,null,"",0]
[null,null,2925,"",null,null,null,"",0]
[null,null,2926,"",null,null,null,"",0]
[null,null,2927,"",null,null,null,"",0]
[null,null,2928,"",null,null,null,"",0]
[null,null,2929,"",null,null,null,"",0]
[null,null,2930,"",null,null,null,"",0]
[null,null,2931,"",null,null,null,"",0]
[null,null,2932,"",null,null,null,"",0]
[null,null,2933,"",null,null,null,"",0]
[null,null,2934,"",null,null,null,"",0]
[null,null,2935,"",null,null,null,"",0]
[null,null,2936,"",null,null,null,"",0]
[null,null,2937,"",null,null,null,"",0]
[null,null,2938,"",null,null,null,"",0]
[null,null,2939,"",null,null,null,"",0]
[null,null,2940,"",null,null,null,"",0]
[null,null,2941,"",null,null,null,"",0]
[null,null,2942,"",null,null,null,"",0]
[null,null,2943,"",null,null,null,"",0]
[null,null,2944,"",null,null,null,"",0]
[null,null,2945,"",null,null,null,"",0]
[null,null,2946,"",null,null,null,"",0]
[null,null,2947,"",null,null,null,"",0]
[null,null,2948,"",null,null,null,"",0]
[null,null,2949,"",null,null,null,"",0]
[null,null,2950,"",null,null,null,"",0]
[null,null,2951,"",null,null,null,"",0]
[null,null,2952,"",null,null,null,"",0]
[null,null,2953,"",null,null,null,"",0]
[null,null,2954,"",null,null,null,"",0]
[null,null,2955,"",null,null,null,"",0]
[null,null,2956,"",null,null,null,"",0]
[null,null,2957,"",null,null,null,"",0]
[null,null,2958,"",null,null,null,"",0]
[null,null,2959,"",null,null,null,"",0]
[null,null,2960,"",null,null,null,"",0]
[null,null,2961,"",null,null,null,"",0]
[null,null,2962,"",null,null,null,"",0]
[null,null,2963,"",null,null,null,"",0]
[null,null,2964,"",null,null,null,"",0]
[null,null,2965,"",null,null,null,"",0]
[null,null,2966,"",null,null,null,"",0]
[null,null,2967,"",null,null,null,"",0]
[null,null,2968,"",null,null,null,"",0]
[null,null,2969,"",null,null,null,"",0]
[null,null,2970,"",null,null,null,"",0]
[null,null,2971,"",null,null,null,"",0]
[null,null,2972,"",null,null,null,"",0]
[null,null,2973,"",null,null,null,"",0]
[null,null,2974,"",null,null,null,"",0]
[null,null,2975,"",null,null,null,"",0]
[null,null,2976,"",null,null,null,"",0]
[null,null,2977,"",null,null,null,"",0]
[null,null,2978,"",null,null,null,"",0]
[null,null,2979,"",null,null,null,"",0]
[null,null,2980,"",null,null,null,"",0]
[null,null,2981,"",null,null,null,"",0]
[null,null,2982,"",null,null,null,"",0]
[null,null,2983,"",null,null,null,"",0]
[null,null,2984,"",null,null,null,"",0]
[null,null,2985,"",null,null,null,"",0]
[null,null,2986,"",null,null,null,"",0]
[null,null,2987,"",null,null,null,"",0]
[null,null,2988,"",null,null,null,"",0]
[null,null,2989,"",null,null,null,"",0]
[null,null,2990,"",null,null,null,"",0]
[null,null,2991,"",null,null,null,"",0]
[null,null,2992,"",null,null,null,"",0]
[null,null,2993,"",null,null,null,"",0]
[null,null,2994,"",null,null,null,"",0]
[null,null,2995,"",null,null,null,"",0]
[null,null,2996,"",null,null,null,"",0]
[null,null,2997,"",null,null,null,"",0]
[null,null,2998,"",null,null,null,"",0]
[null,null,2999,"",null,null,null,"",0]
[null,null,3000,"",null,null,null,"",0]
[null,null,3001,"",null,null,null,"",0]
[null,null,3002,"",null,null,null,"",0]
[null,null,3003,"",null,null,null,"",0]
[null,null,3004,"",null,null,null,"",0]
[null,null,3005,"",null,null,null,"",0]
[null,null,3006,"",null,null,null,"",0]
[null,null,3007,"",null,null,null,"",0]
[null,null,3008,"",null,null,null,"",0]
[null,null,3009,"",null,null,null,"",0]
[null,null,3010,"",null,null,null,"",0]
[null,null,3011,"",null,null,null,"",0]
[null,null,3012,"",null,null,null,"",0]
[null,null,3013,"",null,null,null,"",0]
[null,null,3014,"",null,null,null,"",0]
[null,null,3015,"",null,null,null,"",0]
[null,null,3016,"",null,null,null,"",0]
[null,null,3017,"",null,null,null,"",0]
[null,null,3018,"",null,null,null,"",0]
[null,null,3019,"",null,null,null,"",0]
[null,null,3020,"",null,null,null,"",0]
[null,null,3021,"",null,null,null,"",0]
[null,null,3022,"",null,null,null,"",0]
[null,null,3023,"",null,null,null,"",0]
[null,null,3024,"",null,null,null,"",0]
[null,null,3025,"",null,null,null,"",0]
[null,null,3026,"",null,null,null,"",0]
[null,null,3027,"",null,null,null,"",0]
[null,null,3028,"",null,null,null,"",0]
[null,null,3029,"",null,null,null,"",0]
[null,null,3030,"",null,null,null,"",0]
[null,null,3031,"",null,null,null,"",0]
[null,null,3032,"",null,null,null,"",0]
[null,null,3033,"",null,null,null,"",0]
[null,null,3034,"",null,null,null,"",0]
[null,null,3035,"",null,null,null,"",0]
[null,null,3036,"",null,null,null,"",0]
[null,null,3037,"",null,null,null,"",0]
[null,null,3038,"",null,null,null,"",0]
[null,null,3039,"",null,null,null,"",0]
[null,null,3040,"",null,null,null,"",0]
[null,null,3041,"",null,null,null,"",0]
[null,null,3042,"",null,null,null,"",0]
[null,null,3043,"",null,null,null,"",0]
[null,null,3044,"",null,null,null,"",0]
[null,null,3045,"",null,null,null,"",0]
[null,null,3046,"",null,null,null,"",0]
[null,null,3047,"",null,null,null,"",0]
[null,null,3048,"",null,null,null,"",0]
[null,null,3049,"",null,null,null,"",0]
[null,null,3050,"",null,null,null,"",0]
[null,null,3051,"",null,null,null,"",0]
[null,null,3052,"",null,null,null,"",0]
[null,null,3053,"",null,null,null,"",0]
[null,null,3054,"",null,null,null,"",0]
[null,null,3055,"",null,null,null,"",0]
[null,null,3056,"",null,null,null,"",0]
[null,null,3057,"",null,null,null,"",0]
[null,null,3058,"",null,null,null,"",0]
[null,null,3059,"",null,null,null,"",0]
[null,null,3060,"",null,null,null,"",0]
[null,null,3061,"",null,null,null,"",0]
[null,null,3062,"",null,null,null,"",0]
[null,null,3063,"",null,null,null,"",0]
[null,null,3064,"",null,null,null,"",0]
[null,null,3065,"",null,null,null,"",0]
[null,null,3066,"",null,null,null,"",0]
[null,null,3067,"",null,null,null,"",0]
[null,null,3068,"",null,null,null,"",0]
[null,null,3069,"",null,null,null,"",0]
[null,null,3070,"",null,null,null,"",0]
[null,null,3071,"",null,null,null,"",0]
[null,null,3072,"",null,null,null,"",0]
[null,null,3073,"",null,null,null,"",0]
[null,null,3074,"",null,null,null,"",0]
[null,null,3075,"",null,null,null,"",0]
[null,null,3076,"",null,null,null,"",0]
[null,null,3077,"",null,null,null,"",0]
[null,null,3078,"",null,null,null,"",0]
[null,null,3079,"",null,null,null,"",0]
[null,null,3080,"",null,null,null,"",0]
[null,null,3081,"",null,null,null,"",0]
[null,null,3082,"",null,null,null,"",0]
[null,null,3083,"",null,null,null,"",0]
[null,null,3084,"",null,null,null,"",0]
[null,null,3085,"",null,null,null,"",0]
[null,null,3086,"",null,null,null,"",0]
[null,null,3087,"",null,null,null,"",0]
[null,null,3088,"",null,null,null,"",0]
[null,null,3089,"",null,null,null,"",0]
[null,null,3090,"",null,null,null,"",0]
[null,null,3091,"",null,null,null,"",0]
[null,null,3092,"",null,null,null,"",0]
[null,null,3093,"",null,null,null,"",0]
[null,null,3094,"",null,null,null,"",0]
[null,null,3095,"",null,null,null,"",0]
[null,null,3096,"",null,null,null,"",0]
[null,null,3097,"",null,null,null,"",0]
[null,null,3098,"",null,null,null,"",0]
[null,null,3099,"",null,null,null,"",0]
[null,null,3100,"",null,null,null,"",0]
[null,null,3101,"",null,null,null,"",0]
[null,null,3102,"",null,null,null,"",0]
[null,null,3103,"",null,null,null,"",0]
[null,null,3104,"",null,null,null,"",0]
[null,null,3105,"",null,null,null,"",0]
[null,null,3106,"",null,null,null,"",0]
[null,null,3107,"",null,null,null,"",0]
[null,null,3108,"",null,null,null,"",0]
[null,null,3109,"",null,null,null,"",0]
[null,null,3110,"",null,null,null,"",0]
[null,null,3111,"",null,null,null,"",0]
[null,null,3112,"",null,null,null,"",0]
[null,null,3113,"",null,null,null,"",0]
[null,null,3114,"",null,null,null,"",0]
[null,null,3115,"",null,null,null,"",0]
[null,null,3116,"",null,null,null,"",0]
[null,null,3117,"",null,null,null,"",0]
[null,null,3118,"",null,null,null,"",0]
[null,null,3119,"",null,null,null,"",0]
[null,null,3120,"",null,null,null,"",0]
[null,null,3121,"",null,null,null,"",0]
[null,null,3122,"",null,null,null,"",0]
[null,null,3123,"",null,null,null,"",0]
[null,null,3124,"",null,null,null,"",0]
[null,null,3125,"",null,null,null,"",0]
[null,null,3126,"",null,null,null,"",0]
[null,null,3127,"",null,null,null,"",0]
[null,null,3128,"",null,null,null,"",0]
[null,null,3129,"",null,null,null,"",0]
[null,null,3130,"",null,null,null,"",0]
[null,null,3131,"",null,null,null,"",0]
[null,null,3132,"",null,null,null,"",0]
[null,null,3133,"",null,null,null,"",0]
[null,null,3134,"",null,null,null,"",0]
[null,null,3135,"",null,null,null,"",0]
[null,null,3136,"",null,null,null,"",0]
[null,null,3137,"",null,null,null,"",0]
[null,null,3138,"",null,null,null,"",0]
[null,null,3139,"",null,null,null,"",0]
[null,null,3140,"",null,null,null,"",0]
[null,null,3141,"",null,null,null,"",0]
[null,null,3142,"",null,null,null,"",0]
[null,null,3143,"",null,null,null,"",0]
[null,null,3144,"",null,null,null,"",0]
[null,null,3145,"",null,null,null,"",0]
[null,null,3146,"",null,null,null,"",0]
[null,null,3147,"",null,null,null,"",0]
[null,null,3148,"",null,null,null,"",0]
[null,null,3149,"",null,null,null,"",0]
[null,null,3150,"",null,null,null,"",0]
[null,null,3151,"",null,null,null,"",0]
[null,null,3152,"",null,null,null,"",0]
[null,null,3153,"",null,null,null,"",0]
[null,null,3154,"",null,null,null,"",0]
[null,null,3155,"",null,null,null,"",0]
[null,null,3156,"",null,null,null,"",0]
[null,null,3157,"",null,null,null,"",0]
[null,null,3158,"",null,null,null,"",0]
[null,null,3159,"",null,null,null,"",0]
[null,null,3160,"",null,null,null,"",0]
[null,null,3161,"",null,null,null,"",0]
[null,null,3162,"",null,null,null,"",0]
[null,null,3163,"",null,null,null,"",0]
[null,null,3164,"",null,null,null,"",0]
[null,null,3165,"",null,null,null,"",0]
[null,null,3166,"",null,null,null,"",0]
[null,null,3167,"",null,null,null,"",0]
[null,null,3168,"",null,null,null,"",0]
[null,null,3169,"",null,null,null,"",0]
[null,null,3170,"",null,null,null,"",0]
[null,null,3171,"",null,null,null,"",0]
[null,null,3172,"",null,null,null,"",0]
[null,null,3173,"",null,null,null,"",0]
[null,null,3174,"",null,null,null,"",0]
[null,null,3175,"",null,null,null,"",0]
[null,null,3176,"",null,null,null,"",0]
[null,null,3177,"",null,null,null,"",0]
[null,null,3178,"",null,null,null,"",0]
[null,null,3179,"",null,null,null,"",0]
[null,null,3180,"",null,null,null,"",0]
[null,null,3181,"",null,null,null,"",0]
[null,null,3182,"",null,null,null,"",0]
[null,null,3183,"",null,null,null,"",0]
[null,null,3184,"",null,null,null,"",0]
[null,null,3185,"",null,null,null,"",0]
[null,null,3186,"",null,null,null,"",0]
[null,null,3187,"",null,null,null,"",0]
[null,null,3188,"",null,null,null,"",0]
[null,null,3189,"",null,null,null,"",0]
[null,null,3190,"",null,null,null,"",0]
[null,null,3191,"",null,null,null,"",0]
[null,null,3192,"",null,null,null,"",0]
[null,null,3193,"",null,null,null,"",0]
[null,null,3194,"",null,null,null,"",0]
[null,null,3195,"",null,null,null,"",0]
[null,null,3196,"",null,null,null,"",0]
[null,null,3197,"",null,null,null,"",0]
[null,null,3198,"",null,null,null,"",0]
[null,null,3199,"",null,null,null,"",0]
[null,null,3200,"",null,null,null,"",0]
[null,null,3201,"",null,null,null,"",0]
[null,null,3202,"",null,null,null,"",0]
[null,null,3203,"",null,null,null,"",0]
[null,null,3204,"",null,null,null,"",0]
[null,null,3205,"",null,null,null,"",0]
[null,null,3206,"",null,null,null,"",0]
[null,null,3207,"",null,null,null,"",0]
[null,null,3208,"",null,null,null,"",0]
[null,null,3209,"",null,null,null,"",0]
[null,null,3210,"",null,null,null,"",0]
[null,null,3211,"",null,null,null,"",0]
[null,null,3212,"",null,null,null,"",0]
[null,null,3213,"",null,null,null,"",0]
[null,null,3214,"",null,null,null,"",0]
[null,null,3215,"",null,null,null,"",0]
[null,null,3216,"",null,null,null,"",0]
[null,null,3217,"",null,null,null,"",0]
[null,null,3218,"",null,null,null,"",0]
[null,null,3219,"",null,null,null,"",0]
[null,null,3220,"",null,null,null,"",0]
[null,null,3221,"",null,null,null,"",0]
[null,null,3222,"",null,null,null,"",0]
[null,null,3223,"",null,null,null,"",0]
[null,null,3224,"",null,null,null,"",0]
[null,null,3225,"",null,null,null,"",0]
[null,null,3226,"",null,null,null,"",0]
[null,null,3227,"",null,null,null,"",0]
[null,null,3228,"",null,null,null,"",0]
[null,null,3229,"",null,null,null,"",0]
[null,null,3230,"",null,null,null,"",0]
[null,null,3231,"",null,null,null,"",0]
[null,null,3232,"",null,null,null,"",0]
[null,null,3233,"",null,null,null,"",0]
[null,null,3234,"",null,null,null,"",0]
[null,null,3235,"",null,null,null,"",0]
[null,null,3236,"",null,null,null,"",0]
[null,null,3237,"",null,null,null,"",0]
[null,null,3238,"",null,null,null,"",0]
[null,null,3239,"",null,null,null,"",0]
[null,null,3240,"",null,null,null,"",0]
[null,null,3241,"",null,null,null,"",0]
[null,null,3242,"",null,null,null,"",0]
[null,null,3243,"",null,null,null,"",0]
[null,null,3244,"",null,null,null,"",0]
[null,null,3245,"",null,null,null,"",0]
[null,null,3246,"",null,null,null,"",0]
[null,null,3247,"",null,null,null,"",0]
[null,null,3248,"",null,null,null,"",0]
[null,null,3249,"",null,null,null,"",0]
[null,null,3250,"",null,null,null,"",0]
[null,null,3251,"",null,null,null,"",0]
[null,null,3252,"",null,null,null,"",0]
[null,null,3253,"",null,null,null,"",0]
[null,null,3254,"",null,null,null,"",0]
[null,null,3255,"",null,null,null,"",0]
[null,null,3256,"",null,null,null,"",0]
[null,null,3257,"",null,null,null,"",0]
[null,null,3258,"",null,null,null,"",0]
[null,null,3259,"",null,null,null,"",0]
[null,null,3260,"",null,null,null,"",0]
[null,null,3261,"",null,null,null,"",0]
[null,null,3262,"",null,null,null,"",0]
[null,null,3263,"",null,null,null,"",0]
[null,null,3264,"",null,null,null,"",0]
[null,null,3265,"",null,null,null,"",0]
[null,null,3266,"",null,null,null,"",0]
[null,null,3267,"",null,null,null,"",0]
[null,null,3268,"",null,null,null,"",0]
[null,null,3269,"",null,null,null,"",0]
[null,null,3270,"",null,null,null,"",0]
[null,null,3271,"",null,null,null,"",0]
[null,null,3272,"",null,null,null,"",0]
[null,null,3273,"",null,null,null,"",0]
[null,null,3274,"",null,null,null,"",0]
[null,null,3275,"",null,null,null,"",0]
[null,null,3276,"",null,null,null,"",0]
[null,null,3277,"",null,null,null,"",0]
[null,null,3278,"",null,null,null,"",0]
[null,null,3279,"",null,null,null,"",0]
[null,null,3280,"",null,null,null,"",0]
[null,null,3281,"",null,null,null,"",0]
[null,null,3282,"",null,null,null,"",0]
[null,null,3283,"",null,null,null,"",0]
[null,null,3284,"",null,null,null,"",0]
[null,null,3285,"",null,null,null,"",0]
[null,null,3286,"",null,null,null,"",0]
[null,null,3287,"",null,null,null,"",0]
[null,null,3288,"",null,null,null,"",0]
[null,null,3289,"",null,null,null,"",0]
[null,null,3290,"",null,null,null,"",0]
[null,null,3291,"",null,null,null,"",0]
[null,null,3292,"",null,null,null,"",0]
[null,null,3293,"",null,null,null,"",0]
[null,null,3294,"",null,null,null,"",0]
[null,null,3295,"",null,null,null,"",0]
[null,null,3296,"",null,null,null,"",0]
[null,null,3297,"",null,null,null,"",0]
[null,null,3298,"",null,null,null,"",0]
[null,null,3299,"",null,null,null,"",0]
[null,null,3300,"",null,null,null,"",0]
[null,null,3301,"",null,null,null,"",0]
[null,null,3302,"",null,null,null,"",0]
[null,null,3303,"",null,null,null,"",0]
[null,null,3304,"",null,null,null,"",0]
[null,null,3305,"",null,null,null,"",0]
[null,null,3306,"",null,null,null,"",0]
[null,null,3307,"",null,null,null,"",0]
[null,null,3308,"",null,null,null,"",0]
[null,null,3309,"",null,null,null,"",0]
[null,null,3310,"",null,null,null,"",0]
[null,null,3311,"",null,null,null,"",0]
[null,null,3312,"",null,null,null,"",0]
[null,null,3313,"",null,null,null,"",0]
[null,null,3314,"",null,null,null,"",0]
[null,null,3315,"",null,null,null,"",0]
[null,null,3316,"",null,null,null,"",0]
[null,null,3317,"",null,null,null,"",0]
[null,null,3318,"",null,null,null,"",0]
[null,null,3319,"",null,null,null,"",0]
[null,null,3320,"",null,null,null,"",0]
[null,null,3321,"",null,null,null,"",0]
[null,null,3322,"",null,null,null,"",0]
[null,null,3323,"",null,null,null,"",0]
[null,null,3324,"",null,null,null,"",0]
[null,null,3325,"",null,null,null,"",0]
[null,null,3326,"",null,null,null,"",0]
[null,null,3327,"",null,null,null,"",0]
[null,null,3328,"",null,null,null,"",0]
[null,null,3329,"",null,null,null,"",0]
[null,null,3330,"",null,null,null,"",0]
[null,null,3331,"",null,null,null,"",0]
[null,null,3332,"",null,null,null,"",0]
[null,null,3333,"",null,null,null,"",0]
[null,null,3334,"",null,null,null,"",0]
[null,null,3335,"",null,null,null,"",0]
[null,null,3336,"",null,null,null,"",0]
[null,null,3337,"",null,null,null,"",0]
[null,null,3338,"",null,null,null,"",0]
[null,null,3339,"",null,null,null,"",0]
[null,null,3340,"",null,null,null,"",0]
[null,null,3341,"",null,null,null,"",0]
[null,null,3342,"",null,null,null,"",0]
[null,null,3343,"",null,null,null,"",0]
[null,null,3344,"",null,null,null,"",0]
[null,null,3345,"",null,null,null,"",0]
[null,null,3346,"",null,null,null,"",0]
[null,null,3347,"",null,null,null,"",0]
[null,null,3348,"",null,null,null,"",0]
[null,null,3349,"",null,null,null,"",0]
[null,null,3350,"",null,null,null,"",0]
[null,null,3351,"",null,null,null,"",0]
[null,null,3352,"",null,null,null,"",0]
[null,null,3353,"",null,null,null,"",0]
[null,null,3354,"",null,null,null,"",0]
[null,null,3355,"",null,null,null,"",0]
[null,null,3356,"",null,null,null,"",0]
[null,null,3357,"",null,null,null,"",0]
[null,null,3358,"",null,null,null,"",0]
[null,null,3359,"",null,null,null,"",0]
[null,null,3360,"",null,null,null,"",0]
[null,null,3361,"",null,null,null,"",0]
[null,null,3362,"",null,null,null,"",0]
[null,null,3363,"",null,null,null,"",0]
[null,null,3364,"",null,null,null,"",0]
[null,null,3365,"",null,null,null,"",0]
[null,null,3366,"",null,null,null,"",0]
[null,null,3367,"",null,null,null,"",0]
[null,null,3368,"",null,null,null,"",0]
[null,null,3369,"",null,null,null,"",0]
[null,null,3370,"",null,null,null,"",0]
[null,null,3371,"",null,null,null,"",0]
[null,null,3372,"",null,null,null,"",0]
[null,null,3373,"",null,null,null,"",0]
[null,null,3374,"",null,null,null,"",0]
[null,null,3375,"",null,null,null,"",0]
[null,null,3376,"",null,null,null,"",0]
[null,null,3377,"",null,null,null,"",0]
[null,null,3378,"",null,null,null,"",0]
[null,null,3379,"",null,null,null,"",0]
[null,null,3380,"",null,null,null,"",0]
[null,null,3381,"",null,null,null,"",0]
[null,null,3382,"",null,null,null,"",0]
[null,null,3383,"",null,null,null,"",0]
[null,null,3384,"",null,null,null,"",0]
[null,null,3385,"",null,null,null,"",0]
[null,null,3386,"",null,null,null,"",0]
[null,null,3387,"",null,null,null,"",0]
[null,null,3388,"",null,null,null,"",0]
[null,null,3389,"",null,null,null,"",0]
[null,null,3390,"",null,null,null,"",0]
[null,null,3391,"",null,null,null,"",0]
[null,null,3392,"",null,null,null,"",0]
[null,null,3393,"",null,null,null,"",0]
[null,null,3394,"",null,null,null,"",0]
[null,null,3395,"",null,null,null,"",0]
[null,null,3396,"",null,null,null,"",0]
[null,null,3397,"",null,null,null,"",0]
[null,null,3398,"",null,null,null,"",0]
[null,null,3399,"",null,null,null,"",0]
[null,null,3400,"",null,null,null,"",0]
[null,null,3401,"",null,null,null,"",0]
[null,null,3402,"",null,null,null,"",0]
[null,null,3403,"",null,null,null,"",0]
[null,null,3404,"",null,null,null,"",0]
[null,null,3405,"",null,null,null,"",0]
[null,null,3406,"",null,null,null,"",0]
[null,null,3407,"",null,null,null,"",0]
[null,null,3408,"",null,null,null,"",0]
[null,null,3409,"",null,null,null,"",0]
[null,null,3410,"",null,null,null,"",0]
[null,null,3411,"",null,null,null,"",0]
[null,null,3412,"",null,null,null,"",0]
[null,null,3413,"",null,null,null,"",0]
[null,null,3414,"",null,null,null,"",0]
[null,null,3415,"",null,null,null,"",0]
[null,null,3416,"",null,null,null,"",0]
[null,null,3417,"",null,null,null,"",0]
[null,null,3418,"",null,null,null,"",0]
[null,null,3419,"",null,null,null,"",0]
[null,null,3420,"",null,null,null,"",0]
[null,null,3421,"",null,null,null,"",0]
[null,null,3422,"",null,null,null,"",0]
[null,null,3423,"",null,null,null,"",0]
[null,null,3424,"",null,null,null,"",0]
[null,null,3425,"",null,null,null,"",0]
[null,null,3426,"",null,null,null,"",0]
[null,null,3427,"",null,null,null,"",0]
[null,null,3428,"",null,null,null,"",0]
[null,null,3429,"",null,null,null,"",0]
[null,null,3430,"",null,null,null,"",0]
[null,null,3431,"",null,null,null,"",0]
[null,null,3432,"",null,null,null,"",0]
[null,null,3433,"",null,null,null,"",0]
[null,null,3434,"",null,null,null,"",0]
[null,null,3435,"",null,null,null,"",0]
[null,null,3436,"",null,null,null,"",0]
[null,null,3437,"",null,null,null,"",0]
[null,null,3438,"",null,null,null,"",0]
[null,null,3439,"",null,null,null,"",0]
[null,null,3440,"",null,null,null,"",0]
[null,null,3441,"",null,null,null,"",0]
[null,null,3442,"",null,null,null,"",0]
[null,null,3443,"",null,null,null,"",0]
[null,null,3444,"",null,null,null,"",0]
[null,null,3445,"",null,null,null,"",0]
[null,null,3446,"",null,null,null,"",0]
[null,null,3447,"",null,null,null,"",0]
[null,null,3448,"",null,null,null,"",0]
[null,null,3449,"",null,null,null,"",0]
[null,null,3450,"",null,null,null,"",0]
[null,null,3451,"",null,null,null,"",0]
[null,null,3452,"",null,null,null,"",0]
[null,null,3453,"",null,null,null,"",0]
[null,null,3454,"",null,null,null,"",0]
[null,null,3455,"",null,null,null,"",0]
[null,null,3456,"",null,null,null,"",0]
[null,null,3457,"",null,null,null,"",0]
[null,null,3458,"",null,null,null,"",0]
[null,null,3459,"",null,null,null,"",0]
[null,null,3460,"",null,null,null,"",0]
[null,null,3461,"",null,null,null,"",0]
[null,null,3462,"",null,null,null,"",0]
[null,null,3463,"",null,null,null,"",0]
[null,null,3464,"",null,null,null,"",0]
[null,null,3465,"",null,null,null,"",0]
[null,null,3466,"",null,null,null,"",0]
[null,null,3467,"",null,null,null,"",0]
[null,null,3468,"",null,null,null,"",0]
[null,null,3469,"",null,null,null,"",0]
[null,null,3470,"",null,null,null,"",0]
[null,null,3471,"",null,null,null,"",0]
[null,null,3472,"",null,null,null,"",0]
[null,null,3473,"",null,null,null,"",0]
[null,null,3474,"",null,null,null,"",0]
[null,null,3475,"",null,null,null,"",0]
[null,null,3476,"",null,null,null,"",0]
[null,null,3477,"",null,null,null,"",0]
[null,null,3478,"",null,null,null,"",0]
[null,null,3479,"",null,null,null,"",0]
[null,null,3480,"",null,null,null,"",0]
[null,null,3481,"",null,null,null,"",0]
[null,null,3482,"",null,null,null,"",0]
[null,null,3483,"",null,null,null,"",0]
[null,null,3484,"",null,null,null,"",0]
[null,null,3485,"",null,null,null,"",0]
[null,null,3486,"",null,null,null,"",0]
[null,null,3487,"",null,null,null,"",0]
[null,null,3488,"",null,null,null,"",0]
[null,null,3489,"",null,null,null,"",0]
[null,null,3490,"",null,null,null,"",0]
[null,null,3491,"",null,null,null,"",0]
[null,null,3492,"",null,null,null,"",0]
[null,null,3493,"",null,null,null,"",0]
[null,null,3494,"",null,null,null,"",0]
[null,null,3495,"",null,null,null,"",0]
[null,null,3496,"",null,null,null,"",0]
[null,null,3497,"",null,null,null,"",0]
[null,null,3498,"",null,null,null,"",0]
[null,null,3499,"",null,null,null,"",0]
[null,null,3500,"",null,null,null,"",0]
[null,null,3501,"",null,null,null,"",0]
[null,null,3502,"",null,null,null,"",0]
[null,null,3503,"",null,null,null,"",0]
[null,null,3504,"",null,null,null,"",0]
[null,null,3505,"",null,null,null,"",0]
[null,null,3506,"",null,null,null,"",0]
[null,null,3507,"",null,null,null,"",0]
[null,null,3508,"",null,null,null,"",0]
[null,null,3509,"",null,null,null,"",0]
[null,null,3510,"",null,null,null,"",0]
[null,null,3511,"",null,null,null,"",0]
[null,null,3512,"",null,null,null,"",0]
[null,null,3513,"",null,null,null,"",0]
[null,null,3514,"",null,null,null,"",0]
[null,null,3515,"",null,null,null,"",0]
[null,null,3516,"",null,null,null,"",0]
[null,null,3517,"",null,null,null,"",0]
[null,null,3518,"",null,null,null,"",0]
[null,null,3519,"",null,null,null,"",0]
[null,null,3520,"",null,null,null,"",0]
[null,null,3521,"",null,null,null,"",0]
[null,null,3522,"",null,null,null,"",0]
[null,null,3523,"",null,null,null,"",0]
[null,null,3524,"",null,null,null,"",0]
[null,null,3525,"",null,null,null,"",0]
[null,null,3526,"",null,null,null,"",0]
[null,null,3527,"",null,null,null,"",0]
[null,null,3528,"",null,null,null,"",0]
[null,null,3529,"",null,null,null,"",0]
[null,null,3530,"",null,null,null,"",0]
[null,null,3531,"",null,null,null,"",0]
[null,null,3532,"",null,null,null,"",0]
[null,null,3533,"",null,null,null,"",0]
[null,null,3534,"",null,null,null,"",0]
[null,null,3535,"",null,null,null,"",0]
[null,null,3536,"",null,null,null,"",0]
[null,null,3537,"",null,null,null,"",0]
[null,null,3538,"",null,null,null,"",0]
[null,null,3539,"",null,null,null,"",0]
[null,null,3540,"",null,null,null,"",0]
[null,null,3541,"",null,null,null,"",0]
[null,null,3542,"",null,null,null,"",0]
[null,null,3543,"",null,null,null,"",0]
[null,null,3544,"",null,null,null,"",0]
[null,null,3545,"",null,null,null,"",0]
[null,null,3546,"",null,null,null,"",0]
[null,null,3547,"",null,null,null,"",0]
[null,null,3548,"",null,null,null,"",0]
[null,null,3549,"",null,null,null,"",0]
[null,null,3550,"",null,null,null,"",0]
[null,null,3551,"",null,null,null,"",0]
[null,null,3552,"",null,null,null,"",0]
[null,null,3553,"",null,null,null,"",0]
[null,null,3554,"",null,null,null,"",0]
[null,null,3555,"",null,null,null,"",0]
[null,null,3556,"",null,null,null,"",0]
[null,null,3557,"",null,null,null,"",0]
[null,null,3558,"",null,null,null,"",0]
[null,null,3559,"",null,null,null,"",0]
[null,null,3560,"",null,null,null,"",0]
[null,null,3561,"",null,null,null,"",0]
[null,null,3562,"",null,null,null,"",0]
[null,null,3563,"",null,null,null,"",0]
[null,null,3564,"",null,null,null,"",0]
[null,null,3565,"",null,null,null,"",0]
[null,null,3566,"",null,null,null,"",0]
[null,null,3567,"",null,null,null,"",0]
[null,null,3568,"",null,null,null,"",0]
[null,null,3569,"",null,null,null,"",0]
[null,null,3570,"",null,null,null,"",0]
[null,null,3571,"",null,null,null,"",0]
[null,null,3572,"",null,null,null,"",0]
[null,null,3573,"",null,null,null,"",0]
[null,null,3574,"",null,null,null,"",0]
[null,null,3575,"",null,null,null,"",0]
[null,null,3576,"",null,null,null,"",0]
[null,null,3577,"",null,null,null,"",0]
[null,null,3578,"",null,null,null,"",0]
[null,null,3579,"",null,null,null,"",0]
[null,null,3580,"",null,null,null,"",0]
[null,null,3581,"",null,null,null,"",0]
[null,null,3582,"",null,null,null,"",0]
[null,null,3583,"",null,null,null,"",0]
[null,null,3584,"",null,null,null,"",0]
[null,null,3585,"",null,null,null,"",0]
[null,null,3586,"",null,null,null,"",0]
[null,null,3587,"",null,null,null,"",0]
[null,null,3588,"",null,null,null,"",0]
[null,null,3589,"",null,null,null,"",0]
[null,null,3590,"",null,null,null,"",0]
[null,null,3591,"",null,null,null,"",0]
[null,null,3592,"",null,null,null,"",0]
[null,null,3593,"",null,null,null,"",0]
[null,null,3594,"",null,null,null,"",0]
[null,null,3595,"",null,null,null,"",0]
[null,null,3596,"",null,null,null,"",0]
[null,null,3597,"",null,null,null,"",0]
[null,null,3598,"",null,null,null,"",0]
[null,null,3599,"",null,null,null,"",0]
[null,null,3600,"",null,null,null,"",0]
[null,null,3601,"",null,null,null,"",0]
[null,null,3602,"",null,null,null,"",0]
[null,null,3603,"",null,null,null,"",0]
[null,null,3604,"",null,null,null,"",0]
[null,null,3605,"",null,null,null,"",0]
[null,null,3606,"",null,null,null,"",0]
[null,null,3607,"",null,null,null,"",0]
[null,null,3608,"",null,null,null,"",0]
[null,null,3609,"",null,null,null,"",0]
[null,null,3610,"",null,null,null,"",0]
[null,null,3611,"",null,null,null,"",0]
[null,null,3612,"",null,null,null,"",0]
[null,null,3613,"",null,null,null,"",0]
[null,null,3614,"",null,null,null,"",0]
[null,null,3615,"",null,null,null,"",0]
[null,null,3616,"",null,null,null,"",0]
[null,null,3617,"",null,null,null,"",0]
[null,null,3618,"",null,null,null,"",0]
[null,null,3619,"",null,null,null,"",0]
[null,null,3620,"",null,null,null,"",0]
[null,null,3621,"",null,null,null,"",0]
[null,null,3622,"",null,null,null,"",0]
[null,null,3623,"",null,null,null,"",0]
[null,null,3624,"",null,null,null,"",0]
[null,null,3625,"",null,null,null,"",0]
[null,null,3626,"",null,null,null,"",0]
[null,null,3627,"",null,null,null,"",0]
[null,null,3628,"",null,null,null,"",0]
[null,null,3629,"",null,null,null,"",0]
[null,null,3630,"",null,null,null,"",0]
[null,null,3631,"",null,null,null,"",0]
[null,null,3632,"",null,null,null,"",0]
[null,null,3633,"",null,null,null,"",0]
[null,null,3634,"",null,null,null,"",0]
[null,null,3635,"",null,null,null,"",0]
[null,null,3636,"",null,null,null,"",0]
[null,null,3637,"",null,null,null,"",0]
[null,null,3638,"",null,null,null,"",0]
[null,null,3639,"",null,null,null,"",0]
[null,null,3640,"",null,null,null,"",0]
[null,null,3641,"",null,null,null,"",0]
[null,null,3642,"",null,null,null,"",0]
[null,null,3643,"",null,null,null,"",0]
[null,null,3644,"",null,null,null,"",0]
[null,null,3645,"",null,null,null,"",0]
[null,null,3646,"",null,null,null,"",0]
[null,null,3647,"",null,null,null,"",0]
[null,null,3648,"",null,null,null,"",0]
[null,null,3649,"",null,null,null,"",0]
[null,null,3650,"",null,null,null,"",0]
[null,null,3651,"",null,null,null,"",0]
[null,null,3652,"",null,null,null,"",0]
[null,null,3653,"",null,null,null,"",0]
[null,null,3654,"",null,null,null,"",0]
[null,null,3655,"",null,null,null,"",0]
[null,null,3656,"",null,null,null,"",0]
[null,null,3657,"",null,null,null,"",0]
[null,null,3658,"",null,null,null,"",0]
[null,null,3659,"",null,null,null,"",0]
[null,null,3660,"",null,null,null,"",0]
[null,null,3661,"",null,null,null,"",0]
[null,null,3662,"",null,null,null,"",0]
[null,null,3663,"",null,null,null,"",0]
[null,null,3664,"",null,null,null,"",0]
[null,null,3665,"",null,null,null,"",0]
[null,null,3666,"",null,null,null,"",0]
[null,null,3667,"",null,null,null,"",0]
[null,null,3668,"",null,null,null,"",0]
[null,null,3669,"",null,null,null,"",0]
[null,null,3670,"",null,null,null,"",0]
[null,null,3671,"",null,null,null,"",0]
[null,null,3672,"",null,null,null,"",0]
[null,null,3673,"",null,null,null,"",0]
[null,null,3674,"",null,null,null,"",0]
[null,null,3675,"",null,null,null,"",0]
[null,null,3676,"",null,null,null,"",0]
[null,null,3677,"",null,null,null,"",0]
[null,null,3678,"",null,null,null,"",0]
[null,null,3679,"",null,null,null,"",0]
[null,null,3680,"",null,null,null,"",0]
[null,null,3681,"",null,null,null,"",0]
[null,null,3682,"",null,null,null,"",0]
[null,null,3683,"",null,null,null,"",0]
[null,null,3684,"",null,null,null,"",0]
[null,null,3685,"",null,null,null,"",0]
[null,null,3686,"",null,null,null,"",0]
[null,null,3687,"",null,null,null,"",0]
[null,null,3688,"",null,null,null,"",0]
[null,null,3689,"",null,null,null,"",0]
[null,null,3690,"",null,null,null,"",0]
[null,null,3691,"",null,null,null,"",0]
[null,null,3692,"",null,null,null,"",0]
[null,null,3693,"",null,null,null,"",0]
[null,null,3694,"",null,null,null,"",0]
[null,null,3695,"",null,null,null,"",0]
[null,null,3696,"",null,null,null,"",0]
[null,null,3697,"",null,null,null,"",0]
[null,null,3698,"",null,null,null,"",0]
[null,null,3699,"",null,null,null,"",0]
[null,null,3700,"",null,null,null,"",0]
[null,null,3701,"",null,null,null,"",0]
[null,null,3702,"",null,null,null,"",0]
[null,null,3703,"",null,null,null,"",0]
[null,null,3704,"",null,null,null,"",0]
[null,null,3705,"",null,null,null,"",0]
[null,null,3706,"",null,null,null,"",0]
[null,null,3707,"",null,null,null,"",0]
[null,null,3708,"",null,null,null,"",0]
[null,null,3709,"",null,null,null,"",0]
[null,null,3710,"",null,null,null,"",0]
[null,null,3711,"",null,null,null,"",0]
[null,null,3712,"",null,null,null,"",0]
[null,null,3713,"",null,null,null,"",0]
[null,null,3714,"",null,null,null,"",0]
[null,null,3715,"",null,null,null,"",0]
[null,null,3716,"",null,null,null,"",0]
[null,null,3717,"",null,null,null,"",0]
[null,null,3718,"",null,null,null,"",0]
[null,null,3719,"",null,null,null,"",0]
[null,null,3720,"",null,null,null,"",0]
[null,null,3721,"",null,null,null,"",0]
[null,null,3722,"",null,null,null,"",0]
[null,null,3723,"",null,null,null,"",0]
[null,null,3724,"",null,null,null,"",0]
[null,null,3725,"",null,null,null,"",0]
[null,null,3726,"",null,null,null,"",0]
[null,null,3727,"",null,null,null,"",0]
[null,null,3728,"",null,null,null,"",0]
[null,null,3729,"",null,null,null,"",0]
[null,null,3730,"",null,null,null,"",0]
[null,null,3731,"",null,null,null,"",0]
[null,null,3732,"",null,null,null,"",0]
[null,null,3733,"",null,null,null,"",0]
[null,null,3734,"",null,null,null,"",0]
[null,null,3735,"",null,null,null,"",0]
[null,null,3736,"",null,null,null,"",0]
[null,null,3737,"",null,null,null,"",0]
[null,null,3738,"",null,null,null,"",0]
[null,null,3739,"",null,null,null,"",0]
[null,null,3740,"",null,null,null,"",0]
[null,null,3741,"",null,null,null,"",0]
[null,null,3742,"",null,null,null,"",0]
[null,null,3743,"",null,null,null,"",0]
[null,null,3744,"",null,null,null,"",0]
[null,null,3745,"",null,null,null,"",0]
[null,null,3746,"",null,null,null,"",0]
[null,null,3747,"",null,null,null,"",0]
[null,null,3748,"",null,null,null,"",0]
[null,null,3749,"",null,null,null,"",0]
[null,null,3750,"",null,null,null,"",0]
[null,null,3751,"",null,null,null,"",0]
[null,null,3752,"",null,null,null,"",0]
[null,null,3753,"",null,null,null,"",0]
[null,null,3754,"",null,null,null,"",0]
[null,null,3755,"",null,null,null,"",0]
[null,null,3756,"",null,null,null,"",0]
[null,null,3757,"",null,null,null,"",0]
[null,null,3758,"",null,null,null,"",0]
[null,null,3759,"",null,null,null,"",0]
[null,null,3760,"",null,null,null,"",0]
[null,null,3761,"",null,null,null,"",0]
[null,null,3762,"",null,null,null,"",0]
[null,null,3763,"",null,null,null,"",0]
[null,null,3764,"",null,null,null,"",0]
[null,null,3765,"",null,null,null,"",0]
[null,null,3766,"",null,null,null,"",0]
[null,null,3767,"",null,null,null,"",0]
[null,null,3768,"",null,null,null,"",0]
[null,null,3769,"",null,null,null,"",0]
[null,null,3770,"",null,null,null,"",0]
[null,null,3771,"",null,null,null,"",0]
[null,null,3772,"",null,null,null,"",0]
[null,null,3773,"",null,null,null,"",0]
[null,null,3774,"",null,null,null,"",0]
[null,null,3775,"",null,null,null,"",0]
[null,null,3776,"",null,null,null,"",0]
[null,null,3777,"",null,null,null,"",0]
[null,null,3778,"",null,null,null,"",0]
[null,null,3779,"",null,null,null,"",0]
[null,null,3780,"",null,null,null,"",0]
[null,null,3781,"",null,null,null,"",0]
[null,null,3782,"",null,null,null,"",0]
[null,null,3783,"",null,null,null,"",0]
[null,null,3784,"",null,null,null,"",0]
[null,null,3785,"",null,null,null,"",0]
[null,null,3786,"",null,null,null,"",0]
[null,null,3787,"",null,null,null,"",0]
[null,null,3788,"",null,null,null,"",0]
[null,null,3789,"",null,null,null,"",0]
[null,null,3790,"",null,null,null,"",0]
[null,null,3791,"",null,null,null,"",0]
[null,null,3792,"",null,null,null,"",0]
[null,null,3793,"",null,null,null,"",0]
[null,null,3794,"",null,null,null,"",0]
[null,null,3795,"",null,null,null,"",0]
[null,null,3796,"",null,null,null,"",0]
[null,null,3797,"",null,null,null,"",0]
[null,null,3798,"",null,null,null,"",0]
[null,null,3799,"",null,null,null,"",0]
[null,null,3800,"",null,null,null,"",0]
[null,null,3801,"",null,null,null,"",0]
[null,null,3802,"",null,null,null,"",0]
[null,null,3803,"",null,null,null,"",0]
[null,null,3804,"",null,null,null,"",0]
[null,null,3805,"",null,null,null,"",0]
[null,null,3806,"",null,null,null,"",0]
[null,null,3807,"",null,null,null,"",0]
[null,null,3808,"",null,null,null,"",0]
[null,null,3809,"",null,null,null,"",0]
[null,null,3810,"",null,null,null,"",0]
[null,null,3811,"",null,null,null,"",0]
[null,null,3812,"",null,null,null,"",0]
[null,null,3813,"",null,null,null,"",0]
[null,null,3814,"",null,null,null,"",0]
[null,null,3815,"",null,null,null,"",0]
[null,null,3816,"",null,null,null,"",0]
[null,null,3817,"",null,null,null,"",0]
[null,null,3818,"",null,null,null,"",0]
[null,null,3819,"",null,null,null,"",0]
[null,null,3820,"",null,null,null,"",0]
[null,null,3821,"",null,null,null,"",0]
[null,null,3822,"",null,null,null,"",0]
[null,null,3823,"",null,null,null,"",0]
[null,null,3824,"",null,null,null,"",0]
[null,null,3825,"",null,null,null,"",0]
[null,null,3826,"",null,null,null,"",0]
[null,null,3827,"",null,null,null,"",0]
[null,null,3828,"",null,null,null,"",0]
[null,null,3829,"",null,null,null,"",0]
[null,null,3830,"",null,null,null,"",0]
[null,null,3831,"",null,null,null,"",0]
[null,null,3832,"",null,null,null,"",0]
[null,null,3833,"",null,null,null,"",0]
[null,null,3834,"",null,null,null,"",0]
[null,null,3835,"",null,null,null,"",0]
[null,null,3836,"",null,null,null,"",0]
[null,null,3837,"",null,null,null,"",0]
[null,null,3838,"",null,null,null,"",0]
[null,null,3839,"",null,null,null,"",0]
[null,null,3840,"",null,null,null,"",0]
[null,null,3841,"",null,null,null,"",0]
[null,null,3842,"",null,null,null,"",0]
[null,null,3843,"",null,null,null,"",0]
[null,null,3844,"",null,null,null,"",0]
[null,null,3845,"",null,null,null,"",0]
[null,null,3846,"",null,null,null,"",0]
[null,null,3847,"",null,null,null,"",0]
[null,null,3848,"",null,null,null,"",0]
[null,null,3849,"",null,null,null,"",0]
[null,null,3850,"",null,null,null,"",0]
[null,null,3851,"",null,null,null,"",0]
[null,null,3852,"",null,null,null,"",0]
[null,null,3853,"",null,null,null,"",0]
[null,null,3854,"",null,null,null,"",0]
[null,null,3855,"",null,null,null,"",0]
[null,null,3856,"",null,null,null,"",0]
[null,null,3857,"",null,null,null,"",0]
[null,null,3858,"",null,null,null,"",0]
[null,null,3859,"",null,null,null,"",0]
[null,null,3860,"",null,null,null,"",0]
[null,null,3861,"",null,null,null,"",0]
[null,null,3862,"",null,null,null,"",0]
[null,null,3863,"",null,null,null,"",0]
[null,null,3864,"",null,null,null,"",0]
[null,null,3865,"",null,null,null,"",0]
[null,null,3866,"",null,null,null,"",0]
[null,null,3867,"",null,null,null,"",0]
[null,null,3868,"",null,null,null,"",0]
[null,null,3869,"",null,null,null,"",0]
[null,null,3870,"",null,null,null,"",0]
[null,null,3871,"",null,null,null,"",0]
[null,null,3872,"",null,null,null,"",0]
[null,null,3873,"",null,null,null,"",0]
[null,null,3874,"",null,null,null,"",0]
[null,null,3875,"",null,null,null,"",0]
[null,null,3876,"",null,null,null,"",0]
[null,null,3877,"",null,null,null,"",0]
[null,null,3878,"",null,null,null,"",0]
[null,null,3879,"",null,null,null,"",0]
[null,null,3880,"",null,null,null,"",0]
[null,null,3881,"",null,null,null,"",0]
[null,null,3882,"",null,null,null,"",0]
[null,null,3883,"",null,null,null,"",0]
[null,null,3884,"",null,null,null,"",0]
[null,null,3885,"",null,null,null,"",0]
[null,null,3886,"",null,null,null,"",0]
[null,null,3887,"",null,null,null,"",0]
[null,null,3888,"",null,null,null,"",0]
[null,null,3889,"",null,null,null,"",0]
[null,null,3890,"",null,null,null,"",0]
[null,null,3891,"",null,null,null,"",0]
[null,null,3892,"",null,null,null,"",0]
[null,null,3893,"",null,null,null,"",0]
[null,null,3894,"",null,null,null,"",0]
[null,null,3895,"",null,null,null,"",0]
[null,null,3896,"",null,null,null,"",0]
[null,null,3897,"",null,null,null,"",0]
[null,null,3898,"",null,null,null,"",0]
[null,null,3899,"",null,null,null,"",0]
[null,null,3900,"",null,null,null,"",0]
[null,null,3901,"",null,null,null,"",0]
[null,null,3902,"",null,null,null,"",0]
[null,null,3903,"",null,null,null,"",0]
[null,null,3904,"",null,null,null,"",0]
[null,null,3905,"",null,null,null,"",0]
[null,null,3906,"",null,null,null,"",0]
[null,null,3907,"",null,null,null,"",0]
[null,null,3908,"",null,null,null,"",0]
[null,null,3909,"",null,null,null,"",0]
[null,null,3910,"",null,null,null,"",0]
[null,null,3911,"",null,null,null,"",0]
[null,null,3912,"",null,null,null,"",0]
[null,null,3913,"",null,null,null,"",0]
[null,null,3914,"",null,null,null,"",0]
[null,null,3915,"",null,null,null,"",0]
[null,null,3916,"",null,null,null,"",0]
[null,null,3917,"",null,null,null,"",0]
[null,null,3918,"",null,null,null,"",0]
[null,null,3919,"",null,null,null,"",0]
[null,null,3920,"",null,null,null,"",0]
[null,null,3921,"",null,null,null,"",0]
[null,null,3922,"",null,null,null,"",0]
[null,null,3923,"",null,null,null,"",0]
[null,null,3924,"",null,null,null,"",0]
[null,null,3925,"",null,null,null,"",0]
[null,null,3926,"",null,null,null,"",0]
[null,null,3927,"",null,null,null,"",0]
[null,null,3928,"",null,null,null,"",0]
[null,null,3929,"",null,null,null,"",0]
[null,null,3930,"",null,null,null,"",0]
[null,null,3931,"",null,null,null,"",0]
[null,null,3932,"",null,null,null,"",0]
[null,null,3933,"",null,null,null,"",0]
[null,null,3934,"",null,null,null,"",0]
[null,null,3935,"",null,null,null,"",0]
[null,null,3936,"",null,null,null,"",0]
[null,null,3937,"",null,null,null,"",0]
[null,null,3938,"",null,null,null,"",0]
[null,null,3939,"",null,null,null,"",0]
[null,null,3940,"",null,null,null,"",0]
[null,null,3941,"",null,null,null,"",0]
[null,null,3942,"",null,null,null,"",0]
[null,null,3943,"",null,null,null,"",0]
[null,null,3944,"",null,null,null,"",0]
[null,null,3945,"",null,null,null,"",0]
[null,null,3946,"",null,null,null,"",0]
[null,null,3947,"",null,null,null,"",0]
[null,null,3948,"",null,null,null,"",0]
[null,null,3949,"",null,null,null,"",0]
[null,null,3950,"",null,null,null,"",0]
[null,null,3951,"",null,null,null,"",0]
[null,null,3952,"",null,null,null,"",0]
[null,null,3953,"",null,null,null,"",0]
[null,null,3954,"",null,null,null,"",0]
[null,null,3955,"",null,null,null,"",0]
[null,null,3956,"",null,null,null,"",0]
[null,null,3957,"",null,null,null,"",0]
[null,null,3958,"",null,null,null,"",0]
[null,null,3959,"",null,null,null,"",0]
[null,null,3960,"",null,null,null,"",0]
[null,null,3961,"",null,null,null,"",0]
[null,null,3962,"",null,null,null,"",0]
[null,null,3963,"",null,null,null,"",0]
[null,null,3964,"",null,null,null,"",0]
[null,null,3965,"",null,null,null,"",0]
[null,null,3966,"",null,null,null,"",0]
[null,null,3967,"",null,null,null,"",0]
[null,null,3968,"",null,null,null,"",0]
[null,null,3969,"",null,null,null,"",0]
[null,null,3970,"",null,null,null,"",0]
[null,null,3971,"",null,null,null,"",0]
[null,null,3972,"",null,null,null,"",0]
[null,null,3973,"",null,null,null,"",0]
[null,null,3974,"",null,null,null,"",0]
[null,null,3975,"",null,null,null,"",0]
[null,null,3976,"",null,null,null,"",0]
[null,null,3977,"",null,null,null,"",0]
[null,null,3978,"",null,null,null,"",0]
[null,null,3979,"",null,null,null,"",0]
[null,null,3980,"",null,null,null,"",0]
[null,null,3981,"",null,null,null,"",0]
[null,null,3982,"",null,null,null,"",0]
[null,null,3983,"",null,null,null,"",0]
[null,null,3984,"",null,null,null,"",0]
[null,null,3985,"",null,null,null,"",0]
[null,null,3986,"",null,null,null,"",0]
[null,null,3987,"",null,null,null,"",0]
[null,null,3988,"",null,null,null,"",0]
[null,null,3989,"",null,null,null,"",0]
[null,null,3990,"",null,null,null,"",0]
[null,null,3991,"",null,null,null,"",0]
[null,null,3992,"",null,null,null,"",0]
[null,null,3993,"",null,null,null,"",0]
[null,null,3994,"",null,null,null,"",0]
[null,null,3995,"",null,null,null,"",0]
[null,null,3996,"",null,null,null,"",0]
[null,null,3997,"",null,null,null,"",0]
[null,null,3998,"",null,null,null,"",0]
[null,null,3999,"",null,null,null,"",0]
[null,null,4000,"",null,null,null,"",0]
[null,null,4001,"",null,null,null,"",0]
[null,null,4002,"",null,null,null,"",0]
[null,null,4003,"",null,null,null,"",0]
[null,null,4004,"",null,null,null,"",0]
[null,null,4005,"",null,null,null,"",0]
[null,null,4006,"",null,null,null,"",0]
[null,null,4007,"",null,null,null,"",0]
[null,null,4008,"",null,null,null,"",0]
[null,null,4009,"",null,null,null,"",0]
[null,null,4010,"",null,null,null,"",0]
[null,null,4011,"",null,null,null,"",0]
[null,null,4012,"",null,null,null,"",0]
[null,null,4013,"",null,null,null,"",0]
[null,null,4014,"",null,null,null,"",0]
[null,null,4015,"",null,null,null,"",0]
[null,null,4016,"",null,null,null,"",0]
[null,null,4017,"",null,null,null,"",0]
[null,null,4018,"",null,null,null,"",0]
[null,null,4019,"",null,null,null,"",0]
[null,null,4020,"",null,null,null,"",0]
[null,null,4021,"",null,null,null,"",0]
[null,null,4022,"",null,null,null,"",0]
[null,null,4023,"",null,null,null,"",0]
[null,null,4024,"",null,null,null,"",0]
[null,null,4025,"",null,null,null,"",0]
[null,null,4026,"",null,null,null,"",0]
[null,null,4027,"",null,null,null,"",0]
[null,null,4028,"",null,null,null,"",0]
[null,null,4029,"",null,null,null,"",0]
[null,null,4030,"",null,null,null,"",0]
[null,null,4031,"",null,null,null,"",0]
[null,null,4032,"",null,null,null,"",0]
[null,null,4033,"",null,null,null,"",0]
[null,null,4034,"",null,null,null,"",0]
[null,null,4035,"",null,null,null,"",0]
[null,null,4036,"",null,null,null,"",0]
[null,null,4037,"",null,null,null,"",0]
[null,null,4038,"",null,null,null,"",0]
[null,null,4039,"",null,null,null,"",0]
[null,null,4040,"",null,null,null,"",0]
[null,null,4041,"",null,null,null,"",0]
[null,null,4042,"",null,null,null,"",0]
[null,null,4043,"",null,null,null,"",0]
[null,null,4044,"",null,null,null,"",0]
[null,null,4045,"",null,null,null,"",0]
[null,null,4046,"",null,null,null,"",0]
[null,null,4047,"",null,null,null,"",0]
[null,null,4048,"",null,null,null,"",0]
[null,null,4049,"",null,null,null,"",0]
[null,null,4050,"",null,null,null,"",0]
[null,null,4051,"",null,null,null,"",0]
[null,null,4052,"",null,null,null,"",0]
[null,null,4053,"",null,null,null,"",0]
[null,null,4054,"",null,null,null,"",0]
[null,null,4055,"",null,null,null,"",0]
[null,null,4056,"",null,null,null,"",0]
[null,null,4057,"",null,null,null,"",0]
[null,null,4058,"",null,null,null,"",0]
[null,null,4059,"",null,null,null,"",0]
[null,null,4060,"",null,null,null,"",0]
[null,null,4061,"",null,null,null,"",0]
[null,null,4062,"",null,null,null,"",0]
[null,null,4063,"",null,null,null,"",0]
[null,null,4064,"",null,null,null,"",0]
[null,null,4065,"",null,null,null,"",0]
[null,null,4066,"",null,null,null,"",0]
[null,null,4067,"",null,null,null,"",0]
[null,null,4068,"",null,null,null,"",0]
[null,null,4069,"",null,null,null,"",0]
[null,null,4070,"",null,null,null,"",0]
[null,null,4071,"",null,null,null,"",0]
[null,null,4072,"",null,null,null,"",0]
[null,null,4073,"",null,null,null,"",0]
[null,null,4074,"",null,null,null,"",0]
[null,null,4075,"",null,null,null,"",0]
[null,null,4076,"",null,null,null,"",0]
[null,null,4077,"",null,null,null,"",0]
[null,null,4078,"",null,null,null,"",0]
[null,null,4079,"",null,null,null,"",0]
[null,null,4080,"",null,null,null,"",0]
[null,null,4081,"",null,null,null,"",0]
[null,null,4082,"",null,null,null,"",0]
[null,null,4083,"",null,null,null,"",0]
[null,null,4084,"",null,null,null,"",0]
[null,null,4085,"",null,null,null,"",0]
[null,null,4086,"",null,null,null,"",0]
[null,null,4087,"",null,null,null,"",0]
[null,null,4088,"",null,null,null,"",0]
[null,null,4089,"",null,null,null,"",0]
[null,null,4090,"",null,null,null,"",0]
[null,null,4091,"",null,null,null,"",0]
[null,null,4092,"",null,null,null,"",0]
[null,null,4093,"",null,null,null,"",0]
[null,null,4094,"",null,null,null,"",0]
[null,null,4095,"",null,null,null,"",0]
[null,null,4096,"",null,null,null,"",0]
[null,null,4097,"",null,null,null,"",0]
[null,null,4098,"",null,null,null,"",0]
[null,null,4099,"",null,null,null,"",0]
[null,null,4100,"",null,null,null,"",0]
[null,null,4101,"",null,null,null,"",0]
[null,null,4102,"",null,null,null,"",0]
[null,null,4103,"",null,null,null,"",0]
[null,null,4104,"",null,null,null,"",0]
[null,null,4105,"",null,null,null,"",0]
[null,null,4106,"",null,null,null,"",0]
[null,null,4107,"",null,null,null,"",0]
[null,null,4108,"",null,null,null,"",0]
[null,null,4109,"",null,null,null,"",0]
[null,null,4110,"",null,null,null,"",0]
[null,null,4111,"",null,null,null,"",0]
[null,null,4112,"",null,null,null,"",0]
[null,null,4113,"",null,null,null,"",0]
[null,null,4114,"",null,null,null,"",0]
[null,null,4115,"",null,null,null,"",0]
[null,null,4116,"",null,null,null,"",0]
[null,null,4117,"",null,null,null,"",0]
[null,null,4118,"",null,null,null,"",0]
[null,null,4119,"",null,null,null,"",0]
[null,null,4120,"",null,null,null,"",0]
[null,null,4121,"",null,null,null,"",0]
[null,null,4122,"",null,null,null,"",0]
[null,null,4123,"",null,null,null,"",0]
[null,null,4124,"",null,null,null,"",0]
[null,null,4125,"",null,null,null,"",0]
[null,null,4126,"",null,null,null,"",0]
[null,null,4127,"",null,null,null,"",0]
[null,null,4128,"",null,null,null,"",0]
[null,null,4129,"",null,null,null,"",0]
[null,null,4130,"",null,null,null,"",0]
[null,null,4131,"",null,null,null,"",0]
[null,null,4132,"",null,null,null,"",0]
[null,null,4133,"",null,null,null,"",0]
[null,null,4134,"",null,null,null,"",0]
[null,null,4135,"",null,null,null,"",0]
[null,null,4136,"",null,null,null,"",0]
[null,null,4137,"",null,null,null,"",0]
[null,null,4138,"",null,null,null,"",0]
[null,null,4139,"",null,null,null,"",0]
[null,null,4140,"",null,null,null,"",0]
[null,null,4141,"",null,null,null,"",0]
[null,null,4142,"",null,null,null,"",0]
[null,null,4143,"",null,null,null,"",0]
[null,null,4144,"",null,null,null,"",0]
[null,null,4145,"",null,null,null,"",0]
[null,null,4146,"",null,null,null,"",0]
[null,null,4147,"",null,null,null,"",0]
[null,null,4148,"",null,null,null,"",0]
[null,null,4149,"",null,null,null,"",0]
[null,null,4150,"",null,null,null,"",0]
[null,null,4151,"",null,null,null,"",0]
[null,null,4152,"",null,null,null,"",0]
[null,null,4153,"",null,null,null,"",0]
[null,null,4154,"",null,null,null,"",0]
[null,null,4155,"",null,null,null,"",0]
[null,null,4156,"",null,null,null,"",0]
[null,null,4157,"",null,null,null,"",0]
[null,null,4158,"",null,null,null,"",0]
[null,null,4159,"",null,null,null,"",0]
[null,null,4160,"",null,null,null,"",0]
[null,null,4161,"",null,null,null,"",0]
[null,null,4162,"",null,null,null,"",0]
[null,null,4163,"",null,null,null,"",0]
[null,null,4164,"",null,null,null,"",0]
[null,null,4165,"",null,null,null,"",0]
[null,null,4166,"",null,null,null,"",0]
[null,null,4167,"",null,null,null,"",0]
[null,null,4168,"",null,null,null,"",0]
[null,null,4169,"",null,null,null,"",0]
[null,null,4170,"",null,null,null,"",0]
[null,null,4171,"",null,null,null,"",0]
[null,null,4172,"",null,null,null,"",0]
[null,null,4173,"",null,null,null,"",0]
[null,null,4174,"",null,null,null,"",0]
[null,null,4175,"",null,null,null,"",0]
[null,null,4176,"",null,null,null,"",0]
[null,null,4177,"",null,null,null,"",0]
[null,null,4178,"",null,null,null,"",0]
[null,null,4179,"",null,null,null,"",0]
[null,null,4180,"",null,null,null,"",0]
[null,null,4181,"",null,null,null,"",0]
[null,null,4182,"",null,null,null,"",0]
[null,null,4183,"",null,null,null,"",0]
[null,null,4184,"",null,null,null,"",0]
[null,null,4185,"",null,null,null,"",0]
[null,null,4186,"",null,null,null,"",0]
[null,null,4187,"",null,null,null,"",0]
[null,null,4188,"",null,null,null,"",0]
[null,null,4189,"",null,null,null,"",0]
[null,null,4190,"",null,null,null,"",0]
[null,null,4191,"",null,null,null,"",0]
[null,null,4192,"",null,null,null,"",0]
[null,null,4193,"",null,null,null,"",0]
[null,null,4194,"",null,null,null,"",0]
[null,null,4195,"",null,null,null,"",0]
[null,null,4196,"",null,null,null,"",0]
[null,null,4197,"",null,null,null,"",0]
[null,null,4198,"",null,null,null,"",0]
[null,null,4199,"",null,null,null,"",0]
[null,null,4200,"",null,null,null,"",0]
[null,null,4201,"",null,null,null,"",0]
[null,null,4202,"",null,null,null,"",0]
[null,null,4203,"",null,null,null,"",0]
[null,null,4204,"",null,null,null,"",0]
[null,null,4205,"",null,null,null,"",0]
[null,null,4206,"",null,null,null,"",0]
[null,null,4207,"",null,null,null,"",0]
[null,null,4208,"",null,null,null,"",0]
[null,null,4209,"",null,null,null,"",0]
[null,null,4210,"",null,null,null,"",0]
[null,null,4211,"",null,null,null,"",0]
[null,null,4212,"",null,null,null,"",0]
[null,null,4213,"",null,null,null,"",0]
[null,null,4214,"",null,null,null,"",0]
[null,null,4215,"",null,null,null,"",0]
[null,null,4216,"",null,null,null,"",0]
[null,null,4217,"",null,null,null,"",0]
[null,null,4218,"",null,null,null,"",0]
[null,null,4219,"",null,null,null,"",0]
[null,null,4220,"",null,null,null,"",0]
[null,null,4221,"",null,null,null,"",0]
[null,null,4222,"",null,null,null,"",0]
[null,null,4223,"",null,null,null,"",0]
[null,null,4224,"",null,null,null,"",0]
[null,null,4225,"",null,null,null,"",0]
[null,null,4226,"",null,null,null,"",0]
[null,null,4227,"",null,null,null,"",0]
[null,null,4228,"",null,null,null,"",0]
[null,null,4229,"",null,null,null,"",0]
[null,null,4230,"",null,null,null,"",0]
[null,null,4231,"",null,null,null,"",0]
[null,null,4232,"",null,null,null,"",0]
[null,null,4233,"",null,null,null,"",0]
[null,null,4234,"",null,null,null,"",0]
[null,null,4235,"",null,null,null,"",0]
[null,null,4236,"",null,null,null,"",0]
[null,null,4237,"",null,null,null,"",0]
[null,null,4238,"",null,null,null,"",0]
[null,null,4239,"",null,null,null,"",0]
[null,null,4240,"",null,null,null,"",0]
[null,null,4241,"",null,null,null,"",0]
[null,null,4242,"",null,null,null,"",0]
[null,null,4243,"",null,null,null,"",0]
[null,null,4244,"",null,null,null,"",0]
[null,null,4245,"",null,null,null,"",0]
[null,null,4246,"",null,null,null,"",0]
[null,null,4247,"",null,null,null,"",0]
[null,null,4248,"",null,null,null,"",0]
[null,null,4249,"",null,null,null,"",0]
[null,null,4250,"",null,null,null,"",0]
[null,null,4251,"",null,null,null,"",0]
[null,null,4252,"",null,null,null,"",0]
[null,null,4253,"",null,null,null,"",0]
[null,null,4254,"",null,null,null,"",0]
[null,null,4255,"",null,null,null,"",0]
[null,null,4256,"",null,null,null,"",0]
[null,null,4257,"",null,null,null,"",0]
[null,null,4258,"",null,null,null,"",0]
[null,null,4259,"",null,null,null,"",0]
[null,null,4260,"",null,null,null,"",0]
[null,null,4261,"",null,null,null,"",0]
[null,null,4262,"",null,null,null,"",0]
[null,null,4263,"",null,null,null,"",0]
[null,null,4264,"",null,null,null,"",0]
[null,null,4265,"",null,null,null,"",0]
[null,null,4266,"",null,null,null,"",0]
[null,null,4267,"",null,null,null,"",0]
[null,null,4268,"",null,null,null,"",0]
[null,null,4269,"",null,null,null,"",0]
[null,null,4270,"",null,null,null,"",0]
[null,null,4271,"",null,null,null,"",0]
[null,null,4272,"",null,null,null,"",0]
[null,null,4273,"",null,null,null,"",0]
[null,null,4274,"",null,null,null,"",0]
[null,null,4275,"",null,null,null,"",0]
[null,null,4276,"",null,null,null,"",0]
[null,null,4277,"",null,null,null,"",0]
[null,null,4278,"",null,null,null,"",0]
[null,null,4279,"",null,null,null,"",0]
[null,null,4280,"",null,null,null,"",0]
[null,null,4281,"",null,null,null,"",0]
[null,null,4282,"",null,null,null,"",0]
[null,null,4283,"",null,null,null,"",0]
[null,null,4284,"",null,null,null,"",0]
[null,null,4285,"",null,null,null,"",0]
[null,null,4286,"",null,null,null,"",0]
[null,null,4287,"",null,null,null,"",0]
[null,null,4288,"",null,null,null,"",0]
[null,null,4289,"",null,null,null,"",0]
[null,null,4290,"",null,null,null,"",0]
[null,null,4291,"",null,null,null,"",0]
[null,null,4292,"",null,null,null,"",0]
[null,null,4293,"",null,null,null,"",0]
[null,null,4294,"",null,null,null,"",0]
[null,null,4295,"",null,null,null,"",0]
[null,null,4296,"",null,null,null,"",0]
[null,null,4297,"",null,null,null,"",0]
[null,null,4298,"",null,null,null,"",0]
[null,null,4299,"",null,null,null,"",0]
[null,null,4300,"",null,null,null,"",0]
[null,null,4301,"",null,null,null,"",0]
[null,null,4302,"",null,null,null,"",0]
[null,null,4303,"",null,null,null,"",0]
[null,null,4304,"",null,null,null,"",0]
[null,null,4305,"",null,null,null,"",0]
[null,null,4306,"",null,null,null,"",0]
[null,null,4307,"",null,null,null,"",0]
[null,null,4308,"",null,null,null,"",0]
[null,null,4309,"",null,null,null,"",0]
[null,null,4310,"",null,null,null,"",0]
[null,null,4311,"",null,null,null,"",0]
[null,null,4312,"",null,null,null,"",0]
[null,null,4313,"",null,null,null,"",0]
[null,null,4314,"",null,null,null,"",0]
[null,null,4315,"",null,null,null,"",0]
[null,null,4316,"",null,null,null,"",0]
[null,null,4317,"",null,null,null,"",0]
[null,null,4318,"",null,null,null,"",0]
[null,null,4319,"",null,null,null,"",0]
[null,null,4320,"",null,null,null,"",0]
[null,null,4321,"",null,null,null,"",0]
[null,null,4322,"",null,null,null,"",0]
[null,null,4323,"",null,null,null,"",0]
[null,null,4324,"",null,null,null,"",0]
[null,null,4325,"",null,null,null,"",0]
[null,null,4326,"",null,null,null,"",0]
[null,null,4327,"",null,null,null,"",0]
[null,null,4328,"",null,null,null,"",0]
[null,null,4329,"",null,null,null,"",0]
[null,null,4330,"",null,null,null,"",0]
[null,null,4331,"",null,null,null,"",0]
[null,null,4332,"",null,null,null,"",0]
[null,null,4333,"",null,null,null,"",0]
[null,null,4334,"",null,null,null,"",0]
[null,null,4335,"",null,null,null,"",0]
[null,null,4336,"",null,null,null,"",0]
[null,null,4337,"",null,null,null,"",0]
[null,null,4338,"",null,null,null,"",0]
[null,null,4339,"",null,null,null,"",0]
[null,null,4340,"",null,null,null,"",0]
[null,null,4341,"",null,null,null,"",0]
[null,null,4342,"",null,null,null,"",0]
[null,null,4343,"",null,null,null,"",0]
[null,null,4344,"",null,null,null,"",0]
[null,null,4345,"",null,null,null,"",0]
[null,null,4346,"",null,null,null,"",0]
[null,null,4347,"",null,null,null,"",0]
[null,null,4348,"",null,null,null,"",0]
[null,null,4349,"",null,null,null,"",0]
[null,null,4350,"",null,null,null,"",0]
[null,null,4351,"",null,null,null,"",0]
[null,null,4352,"",null,null,null,"",0]
[null,null,4353,"",null,null,null,"",0]
[null,null,4354,"",null,null,null,"",0]
[null,null,4355,"",null,null,null,"",0]
[null,null,4356,"",null,null,null,"",0]
[null,null,4357,"",null,null,null,"",0]
[null,null,4358,"",null,null,null,"",0]
[null,null,4359,"",null,null,null,"",0]
[null,null,4360,"",null,null,null,"",0]
[null,null,4361,"",null,null,null,"",0]
[null,null,4362,"",null,null,null,"",0]
[null,null,4363,"",null,null,null,"",0]
[null,null,4364,"",null,null,null,"",0]
[null,null,4365,"",null,null,null,"",0]
[null,null,4366,"",null,null,null,"",0]
[null,null,4367,"",null,null,null,"",0]
[null,null,4368,"",null,null,null,"",0]
[null,null,4369,"",null,null,null,"",0]
[null,null,4370,"",null,null,null,"",0]
[null,null,4371,"",null,null,null,"",0]
[null,null,4372,"",null,null,null,"",0]
[null,null,4373,"",null,null,null,"",0]
[null,null,4374,"",null,null,null,"",0]
[null,null,4375,"",null,null,null,"",0]
[null,null,4376,"",null,null,null,"",0]
[null,null,4377,"",null,null,null,"",0]
[null,null,4378,"",null,null,null,"",0]
[null,null,4379,"",null,null,null,"",0]
[null,null,4380,"",null,null,null,"",0]
[null,null,4381,"",null,null,null,"",0]
[null,null,4382,"",null,null,null,"",0]
[null,null,4383,"",null,null,null,"",0]
[null,null,4384,"",null,null,null,"",0]
[null,null,4385,"",null,null,null,"",0]
[null,null,4386,"",null,null,null,"",0]
[null,null,4387,"",null,null,null,"",0]
[null,null,4388,"",null,null,null,"",0]
[null,null,4389,"",null,null,null,"",0]
[null,null,4390,"",null,null,null,"",0]
[null,null,4391,"",null,null,null,"",0]
[null,null,4392,"",null,null,null,"",0]
[null,null,4393,"",null,null,null,"",0]
[null,null,4394,"",null,null,null,"",0]
[null,null,4395,"",null,null,null,"",0]
[null,null,4396,"",null,null,null,"",0]
[null,null,4397,"",null,null,null,"",0]
[null,null,4398,"",null,null,null,"",0]
[null,null,4399,"",null,null,null,"",0]
[null,null,4400,"",null,null,null,"",0]
[null,null,4401,"",null,null,null,"",0]
[null,null,4402,"",null,null,null,"",0]
[null,null,4403,"",null,null,null,"",0]
[null,null,4404,"",null,null,null,"",0]
[null,null,4405,"",null,null,null,"",0]
[null,null,4406,"",null,null,null,"",0]
[null,null,4407,"",null,null,null,"",0]
[null,null,4408,"",null,null,null,"",0]
[null,null,4409,"",null,null,null,"",0]
[null,null,4410,"",null,null,null,"",0]
[null,null,4411,"",null,null,null,"",0]
[null,null,4412,"",null,null,null,"",0]
[null,null,4413,"",null,null,null,"",0]
[null,null,4414,"",null,null,null,"",0]
[null,null,4415,"",null,null,null,"",0]
[null,null,4416,"",null,null,null,"",0]
[null,null,4417,"",null,null,null,"",0]
[null,null,4418,"",null,null,null,"",0]
[null,null,4419,"",null,null,null,"",0]
[null,null,4420,"",null,null,null,"",0]
[null,null,4421,"",null,null,null,"",0]
[null,null,4422,"",null,null,null,"",0]
[null,null,4423,"",null,null,null,"",0]
[null,null,4424,"",null,null,null,"",0]
[null,null,4425,"",null,null,null,"",0]
[null,null,4426,"",null,null,null,"",0]
[null,null,4427,"",null,null,null,"",0]
[null,null,4428,"",null,null,null,"",0]
[null,null,4429,"",null,null,null,"",0]
[null,null,4430,"",null,null,null,"",0]
[null,null,4431,"",null,null,null,"",0]
[null,null,4432,"",null,null,null,"",0]
[null,null,4433,"",null,null,null,"",0]
[null,null,4434,"",null,null,null,"",0]
[null,null,4435,"",null,null,null,"",0]
[null,null,4436,"",null,null,null,"",0]
[null,null,4437,"",null,null,null,"",0]
[null,null,4438,"",null,null,null,"",0]
[null,null,4439,"",null,null,null,"",0]
[null,null,4440,"",null,null,null,"",0]
[null,null,4441,"",null,null,null,"",0]
[null,null,4442,"",null,null,null,"",0]
[null,null,4443,"",null,null,null,"",0]
[null,null,4444,"",null,null,null,"",0]
[null,null,4445,"",null,null,null,"",0]
[null,null,4446,"",null,null,null,"",0]
[null,null,4447,"",null,null,null,"",0]
[null,null,4448,"",null,null,null,"",0]
[null,null,4449,"",null,null,null,"",0]
[null,null,4450,"",null,null,null,"",0]
[null,null,4451,"",null,null,null,"",0]
[null,null,4452,"",null,null,null,"",0]
[null,null,4453,"",null,null,null,"",0]
[null,null,4454,"",null,null,null,"",0]
[null,null,4455,"",null,null,null,"",0]
[null,null,4456,"",null,null,null,"",0]
[null,null,4457,"",null,null,null,"",0]
[null,null,4458,"",null,null,null,"",0]
[null,null,4459,"",null,null,null,"",0]
[null,null,4460,"",null,null,null,"",0]
[null,null,4461,"",null,null,null,"",0]
[null,null,4462,"",null,null,null,"",0]
[null,null,4463,"",null,null,null,"",0]
[null,null,4464,"",null,null,null,"",0]
[null,null,4465,"",null,null,null,"",0]
[null,null,4466,"",null,null,null,"",0]
[null,null,4467,"",null,null,null,"",0]
[null,null,4468,"",null,null,null,"",0]
[null,null,4469,"",null,null,null,"",0]
[null,null,4470,"",null,null,null,"",0]
[null,null,4471,"",null,null,null,"",0]
[null,null,4472,"",null,null,null,"",0]
[null,null,4473,"",null,null,null,"",0]
[null,null,4474,"",null,null,null,"",0]
[null,null,4475,"",null,null,null,"",0]
[null,null,4476,"",null,null,null,"",0]
[null,null,4477,"",null,null,null,"",0]
[null,null,4478,"",null,null,null,"",0]
[null,null,4479,"",null,null,null,"",0]
[null,null,4480,"",null,null,null,"",0]
[null,null,4481,"",null,null,null,"",0]
[null,null,4482,"",null,null,null,"",0]
[null,null,4483,"",null,null,null,"",0]
[null,null,4484,"",null,null,null,"",0]
[null,null,4485,"",null,null,null,"",0]
[null,null,4486,"",null,null,null,"",0]
[null,null,4487,"",null,null,null,"",0]
[null,null,4488,"",null,null,null,"",0]
[null,null,4489,"",null,null,null,"",0]
[null,null,4490,"",null,null,null,"",0]
[null,null,4491,"",null,null,null,"",0]
[null,null,4492,"",null,null,null,"",0]
[null,null,4493,"",null,null,null,"",0]
[null,null,4494,"",null,null,null,"",0]
[null,null,4495,"",null,null,null,"",0]
[null,null,4496,"",null,null,null,"",0]
[null,null,4497,"",null,null,null,"",0]
[null,null,4498,"",null,null,null,"",0]
[null,null,4499,"",null,null,null,"",0]
[null,null,4500,"",null,null,null,"",0]
[null,null,4501,"",null,null,null,"",0]
[null,null,4502,"",null,null,null,"",0]
[null,null,4503,"",null,null,null,"",0]
[null,null,4504,"",null,null,null,"",0]
[null,null,4505,"",null,null,null,"",0]
[null,null,4506,"",null,null,null,"",0]
[null,null,4507,"",null,null,null,"",0]
[null,null,4508,"",null,null,null,"",0]
[null,null,4509,"",null,null,null,"",0]
[null,null,4510,"",null,null,null,"",0]
[null,null,4511,"",null,null,null,"",0]
[null,null,4512,"",null,null,null,"",0]
[null,null,4513,"",null,null,null,"",0]
[null,null,4514,"",null,null,null,"",0]
[null,null,4515,"",null,null,null,"",0]
[null,null,4516,"",null,null,null,"",0]
[null,null,4517,"",null,null,null,"",0]
[null,null,4518,"",null,null,null,"",0]
[null,null,4519,"",null,null,null,"",0]
[null,null,4520,"",null,null,null,"",0]
[null,null,4521,"",null,null,null,"",0]
[null,null,4522,"",null,null,null,"",0]
[null,null,4523,"",null,null,null,"",0]
[null,null,4524,"",null,null,null,"",0]
[null,null,4525,"",null,null,null,"",0]
[null,null,4526,"",null,null,null,"",0]
[null,null,4527,"",null,null,null,"",0]
[null,null,4528,"",null,null,null,"",0]
[null,null,4529,"",null,null,null,"",0]
[null,null,4530,"",null,null,null,"",0]
[null,null,4531,"",null,null,null,"",0]
[null,null,4532,"",null,null,null,"",0]
[null,null,4533,"",null,null,null,"",0]
[null,null,4534,"",null,null,null,"",0]
[null,null,4535,"",null,null,null,"",0]
[null,null,4536,"",null,null,null,"",0]
[null,null,4537,"",null,null,null,"",0]
[null,null,4538,"",null,null,null,"",0]
[null,null,4539,"",null,null,null,"",0]
[null,null,4540,"",null,null,null,"",0]
[null,null,4541,"",null,null,null,"",0]
[null,null,4542,"",null,null,null,"",0]
[null,null,4543,"",null,null,null,"",0]
[null,null,4544,"",null,null,null,"",0]
[null,null,4545,"",null,null,null,"",0]
[null,null,4546,"",null,null,null,"",0]
[null,null,4547,"",null,null,null,"",0]
[null,null,4548,"",null,null,null,"",0]
[null,null,4549,"",null,null,null,"",0]
[null,null,4550,"",null,null,null,"",0]
[null,null,4551,"",null,null,null,"",0]
[null,null,4552,"",null,null,null,"",0]
[null,null,4553,"",null,null,null,"",0]
[null,null,4554,"",null,null,null,"",0]
[null,null,4555,"",null,null,null,"",0]
[null,null,4556,"",null,null,null,"",0]
[null,null,4557,"",null,null,null,"",0]
[null,null,4558,"",null,null,null,"",0]
[null,null,4559,"",null,null,null,"",0]
[null,null,4560,"",null,null,null,"",0]
[null,null,4561,"",null,null,null,"",0]
[null,null,4562,"",null,null,null,"",0]
[null,null,4563,"",null,null,null,"",0]
[null,null,4564,"",null,null,null,"",0]
[null,null,4565,"",null,null,null,"",0]
[null,null,4566,"",null,null,null,"",0]
[null,null,4567,"",null,null,null,"",0]
[null,null,4568,"",null,null,null,"",0]
[null,null,4569,"",null,null,null,"",0]
[null,null,4570,"",null,null,null,"",0]
[null,null,4571,"",null,null,null,"",0]
[null,null,4572,"",null,null,null,"",0]
[null,null,4573,"",null,null,null,"",0]
[null,null,4574,"",null,null,null,"",0]
[null,null,4575,"",null,null,null,"",0]
[null,null,4576,"",null,null,null,"",0]
[null,null,4577,"",null,null,null,"",0]
[null,null,4578,"",null,null,null,"",0]
[null,null,4579,"",null,null,null,"",0]
[null,null,4580,"",null,null,null,"",0]
[null,null,4581,"",null,null,null,"",0]
[null,null,4582,"",null,null,null,"",0]
[null,null,4583,"",null,null,null,"",0]
[null,null,4584,"",null,null,null,"",0]
[null,null,4585,"",null,null,null,"",0]
[null,null,4586,"",null,null,null,"",0]
[null,null,4587,"",null,null,null,"",0]
[null,null,4588,"",null,null,null,"",0]
[null,null,4589,"",null,null,null,"",0]
[null,null,4590,"",null,null,null,"",0]
[null,null,4591,"",null,null,null,"",0]
[null,null,4592,"",null,null,null,"",0]
[null,null,4593,"",null,null,null,"",0]
[null,null,4594,"",null,null,null,"",0]
[null,null,4595,"",null,null,null,"",0]
[null,null,4596,"",null,null,null,"",0]
[null,null,4597,"",null,null,null,"",0]
[null,null,4598,"",null,null,null,"",0]
[null,null,4599,"",null,null,null,"",0]
[null,null,4600,"",null,null,null,"",0]
[null,null,4601,"",null,null,null,"",0]
[null,null,4602,"",null,null,null,"",0]
[null,null,4603,"",null,null,null,"",0]
[null,null,4604,"",null,null,null,"",0]
[null,null,4605,"",null,null,null,"",0]
[null,null,4606,"",null,null,null,"",0]
[null,null,4607,"",null,null,null,"",0]
[null,null,4608,"",null,null,null,"",0]
[null,null,4609,"",null,null,null,"",0]
[null,null,4610,"",null,null,null,"",0]
[null,null,4611,"",null,null,null,"",0]
[null,null,4612,"",null,null,null,"",0]
[null,null,4613,"",null,null,null,"",0]
[null,null,4614,"",null,null,null,"",0]
[null,null,4615,"",null,null,null,"",0]
[null,null,4616,"",null,null,null,"",0]
[null,null,4617,"",null,null,null,"",0]
[null,null,4618,"",null,null,null,"",0]
[null,null,4619,"",null,null,null,"",0]
[null,null,4620,"",null,null,null,"",0]
[null,null,4621,"",null,null,null,"",0]
[null,null,4622,"",null,null,null,"",0]
[null,null,4623,"",null,null,null,"",0]
[null,null,4624,"",null,null,null,"",0]
[null,null,4625,"",null,null,null,"",0]
[null,null,4626,"",null,null,null,"",0]
[null,null,4627,"",null,null,null,"",0]
[null,null,4628,"",null,null,null,"",0]
[null,null,4629,"",null,null,null,"",0]
[null,null,4630,"",null,null,null,"",0]
[null,null,4631,"",null,null,null,"",0]
[null,null,4632,"",null,null,null,"",0]
[null,null,4633,"",null,null,null,"",0]
[null,null,4634,"",null,null,null,"",0]
[null,null,4635,"",null,null,null,"",0]
[null,null,4636,"",null,null,null,"",0]
[null,null,4637,"",null,null,null,"",0]
[null,null,4638,"",null,null,null,"",0]
[null,null,4639,"",null,null,null,"",0]
[null,null,4640,"",null,null,null,"",0]
[null,null,4641,"",null,null,null,"",0]
[null,null,4642,"",null,null,null,"",0]
[null,null,4643,"",null,null,null,"",0]
[null,null,4644,"",null,null,null,"",0]
[null,null,4645,"",null,null,null,"",0]
[null,null,4646,"",null,null,null,"",0]
[null,null,4647,"",null,null,null,"",0]
[null,null,4648,"",null,null,null,"",0]
[null,null,4649,"",null,null,null,"",0]
[null,null,4650,"",null,null,null,"",0]
[null,null,4651,"",null,null,null,"",0]
[null,null,4652,"",null,null,null,"",0]
[null,null,4653,"",null,null,null,"",0]
[null,null,4654,"",null,null,null,"",0]
[null,null,4655,"",null,null,null,"",0]
[null,null,4656,"",null,null,null,"",0]
[null,null,4657,"",null,null,null,"",0]
[null,null,4658,"",null,null,null,"",0]
[null,null,4659,"",null,null,null,"",0]
[null,null,4660,"",null,null,null,"",0]
[null,null,4661,"",null,null,null,"",0]
[null,null,4662,"",null,null,null,"",0]
[null,null,4663,"",null,null,null,"",0]
[null,null,4664,"",null,null,null,"",0]
[null,null,4665,"",null,null,null,"",0]
[null,null,4666,"",null,null,null,"",0]
[null,null,4667,"",null,null,null,"",0]
[null,null,4668,"",null,null,null,"",0]
[null,null,4669,"",null,null,null,"",0]
[null,null,4670,"",null,null,null,"",0]
[null,null,4671,"",null,null,null,"",0]
[null,null,4672,"",null,null,null,"",0]
[null,null,4673,"",null,null,null,"",0]
[null,null,4674,"",null,null,null,"",0]
[null,null,4675,"",null,null,null,"",0]
[null,null,4676,"",null,null,null,"",0]
[null,null,4677,"",null,null,null,"",0]
[null,null,4678,"",null,null,null,"",0]
[null,null,4679,"",null,null,null,"",0]
[null,null,4680,"",null,null,null,"",0]
[null,null,4681,"",null,null,null,"",0]
[null,null,4682,"",null,null,null,"",0]
[null,null,4683,"",null,null,null,"",0]
[null,null,4684,"",null,null,null,"",0]
[null,null,4685,"",null,null,null,"",0]
[null,null,4686,"",null,null,null,"",0]
[null,null,4687,"",null,null,null,"",0]
[null,null,4688,"",null,null,null,"",0]
[null,null,4689,"",null,null,null,"",0]
[null,null,4690,"",null,null,null,"",0]
[null,null,4691,"",null,null,null,"",0]
[null,null,4692,"",null,null,null,"",0]
[null,null,4693,"",null,null,null,"",0]
[null,null,4694,"",null,null,null,"",0]
[null,null,4695,"",null,null,null,"",0]
[null,null,4696,"",null,null,null,"",0]
[null,null,4697,"",null,null,null,"",0]
[null,null,4698,"",null,null,null,"",0]
[null,null,4699,"",null,null,null,"",0]
[null,null,4700,"",null,null,null,"",0]
[null,null,4701,"",null,null,null,"",0]
[null,null,4702,"",null,null,null,"",0]
[null,null,4703,"",null,null,null,"",0]
[null,null,4704,"",null,null,null,"",0]
[null,null,4705,"",null,null,null,"",0]
[null,null,4706,"",null,null,null,"",0]
[null,null,4707,"",null,null,null,"",0]
[null,null,4708,"",null,null,null,"",0]
[null,null,4709,"",null,null,null,"",0]
[null,null,4710,"",null,null,null,"",0]
[null,null,4711,"",null,null,null,"",0]
[null,null,4712,"",null,null,null,"",0]
[null,null,4713,"",null,null,null,"",0]
[null,null,4714,"",null,null,null,"",0]
[null,null,4715,"",null,null,null,"",0]
[null,null,4716,"",null,null,null,"",0]
[null,null,4717,"",null,null,null,"",0]
[null,null,4718,"",null,null,null,"",0]
[null,null,4719,"",null,null,null,"",0]
[null,null,4720,"",null,null,null,"",0]
[null,null,4721,"",null,null,null,"",0]
[null,null,4722,"",null,null,null,"",0]
[null,null,4723,"",null,null,null,"",0]
[null,null,4724,"",null,null,null,"",0]
[null,null,4725,"",null,null,null,"",0]
[null,null,4726,"",null,null,null,"",0]
[null,null,4727,"",null,null,null,"",0]
[null,null,4728,"",null,null,null,"",0]
[null,null,4729,"",null,null,null,"",0]
[null,null,4730,"",null,null,null,"",0]
[null,null,4731,"",null,null,null,"",0]
[null,null,4732,"",null,null,null,"",0]
[null,null,4733,"",null,null,null,"",0]
[null,null,4734,"",null,null,null,"",0]
[null,null,4735,"",null,null,null,"",0]
[null,null,4736,"",null,null,null,"",0]
[null,null,4737,"",null,null,null,"",0]
[null,null,4738,"",null,null,null,"",0]
[null,null,4739,"",null,null,null,"",0]
[null,null,4740,"",null,null,null,"",0]
[null,null,4741,"",null,null,null,"",0]
[null,null,4742,"",null,null,null,"",0]
[null,null,4743,"",null,null,null,"",0]
[null,null,4744,"",null,null,null,"",0]
[null,null,4745,"",null,null,null,"",0]
[null,null,4746,"",null,null,null,"",0]
[null,null,4747,"",null,null,null,"",0]
[null,null,4748,"",null,null,null,"",0]
[null,null,4749,"",null,null,null,"",0]
[null,null,4750,"",null,null,null,"",0]
[null,null,4751,"",null,null,null,"",0]
[null,null,4752,"",null,null,null,"",0]
[null,null,4753,"",null,null,null,"",0]
[null,null,4754,"",null,null,null,"",0]
[null,null,4755,"",null,null,null,"",0]
[null,null,4756,"",null,null,null,"",0]
[null,null,4757,"",null,null,null,"",0]
[null,null,4758,"",null,null,null,"",0]
[null,null,4759,"",null,null,null,"",0]
[null,null,4760,"",null,null,null,"",0]
[null,null,4761,"",null,null,null,"",0]
[null,null,4762,"",null,null,null,"",0]
[null,null,4763,"",null,null,null,"",0]
[null,null,4764,"",null,null,null,"",0]
[null,null,4765,"",null,null,null,"",0]
[null,null,4766,"",null,null,null,"",0]
[null,null,4767,"",null,null,null,"",0]
[null,null,4768,"",null,null,null,"",0]
[null,null,4769,"",null,null,null,"",0]
[null,null,4770,"",null,null,null,"",0]
[null,null,4771,"",null,null,null,"",0]
[null,null,4772,"",null,null,null,"",0]
[null,null,4773,"",null,null,null,"",0]
[null,null,4774,"",null,null,null,"",0]
[null,null,4775,"",null,null,null,"",0]
[null,null,4776,"",null,null,null,"",0]
[null,null,4777,"",null,null,null,"",0]
[null,null,4778,"",null,null,null,"",0]
[null,null,4779,"",null,null,null,"",0]
[null,null,4780,"",null,null,null,"",0]
[null,null,4781,"",null,null,null,"",0]
[null,null,4782,"",null,null,null,"",0]
[null,null,4783,"",null,null,null,"",0]
[null,null,4784,"",null,null,null,"",0]
[null,null,4785,"",null,null,null,"",0]
[null,null,4786,"",null,null,null,"",0]
[null,null,4787,"",null,null,null,"",0]
[null,null,4788,"",null,null,null,"",0]
[null,null,4789,"",null,null,null,"",0]
[null,null,4790,"",null,null,null,"",0]
[null,null,4791,"",null,null,null,"",0]
[null,null,4792,"",null,null,null,"",0]
[null,null,4793,"",null,null,null,"",0]
[null,null,4794,"",null,null,null,"",0]
[null,null,4795,"",null,null,null,"",0]
[null,null,4796,"",null,null,null,"",0]
[null,null,4797,"",null,null,null,"",0]
[null,null,4798,"",null,null,null,"",0]
[null,null,4799,"",null,null,null,"",0]
[null,null,4800,"",null,null,null,"",0]
[null,null,4801,"",null,null,null,"",0]
[null,null,4802,"",null,null,null,"",0]
[null,null,4803,"",null,null,null,"",0]
[null,null,4804,"",null,null,null,"",0]
[null,null,4805,"",null,null,null,"",0]
[null,null,4806,"",null,null,null,"",0]
[null,null,4807,"",null,null,null,"",0]
[null,null,4808,"",null,null,null,"",0]
[null,null,4809,"",null,null,null,"",0]
[null,null,4810,"",null,null,null,"",0]
[null,null,4811,"",null,null,null,"",0]
[null,null,4812,"",null,null,null,"",0]
[null,null,4813,"",null,null,null,"",0]
[null,null,4814,"",null,null,null,"",0]
[null,null,4815,"",null,null,null,"",0]
[null,null,4816,"",null,null,null,"",0]
[null,null,4817,"",null,null,null,"",0]
[null,null,4818,"",null,null,null,"",0]
[null,null,4819,"",null,null,null,"",0]
[null,null,4820,"",null,null,null,"",0]
[null,null,4821,"",null,null,null,"",0]
[null,null,4822,"",null,null,null,"",0]
[null,null,4823,"",null,null,null,"",0]
[null,null,4824,"",null,null,null,"",0]
[null,null,4825,"",null,null,null,"",0]
[null,null,4826,"",null,null,null,"",0]
[null,null,4827,"",null,null,null,"",0]
[null,null,4828,"",null,null,null,"",0]
[null,null,4829,"",null,null,null,"",0]
[null,null,4830,"",null,null,null,"",0]
[null,null,4831,"",null,null,null,"",0]
[null,null,4832,"",null,null,null,"",0]
[null,null,4833,"",null,null,null,"",0]
[null,null,4834,"",null,null,null,"",0]
[null,null,4835,"",null,null,null,"",0]
[null,null,4836,"",null,null,null,"",0]
[null,null,4837,"",null,null,null,"",0]
[null,null,4838,"",null,null,null,"",0]
[null,null,4839,"",null,null,null,"",0]
[null,null,4840,"",null,null,null,"",0]
[null,null,4841,"",null,null,null,"",0]
[null,null,4842,"",null,null,null,"",0]
[null,null,4843,"",null,null,null,"",0]
[null,null,4844,"",null,null,null,"",0]
[null,null,4845,"",null,null,null,"",0]
[null,null,4846,"",null,null,null,"",0]
[null,null,4847,"",null,null,null,"",0]
[null,null,4848,"",null,null,null,"",0]
[null,null,4849,"",null,null,null,"",0]
[null,null,4850,"",null,null,null,"",0]
[null,null,4851,"",null,null,null,"",0]
[null,null,4852,"",null,null,null,"",0]
[null,null,4853,"",null,null,null,"",0]
[null,null,4854,"",null,null,null,"",0]
[null,null,4855,"",null,null,null,"",0]
[null,null,4856,"",null,null,null,"",0]
[null,null,4857,"",null,null,null,"",0]
[null,null,4858,"",null,null,null,"",0]
[null,null,4859,"",null,null,null,"",0]
[null,null,4860,"",null,null,null,"",0]
[null,null,4861,"",null,null,null,"",0]
[null,null,4862,"",null,null,null,"",0]
[null,null,4863,"",null,null,null,"",0]
[null,null,4864,"",null,null,null,"",0]
[null,null,4865,"",null,null,null,"",0]
[null,null,4866,"",null,null,null,"",0]
[null,null,4867,"",null,null,null,"",0]
[null,null,4868,"",null,null,null,"",0]
[null,null,4869,"",null,null,null,"",0]
[null,null,4870,"",null,null,null,"",0]
[null,null,4871,"",null,null,null,"",0]
[null,null,4872,"",null,null,null,"",0]
[null,null,4873,"",null,null,null,"",0]
[null,null,4874,"",null,null,null,"",0]
[null,null,4875,"",null,null,null,"",0]
[null,null,4876,"",null,null,null,"",0]
[null,null,4877,"",null,null,null,"",0]
[null,null,4878,"",null,null,null,"",0]
[null,null,4879,"",null,null,null,"",0]
[null,null,4880,"",null,null,null,"",0]
[null,null,4881,"",null,null,null,"",0]
[null,null,4882,"",null,null,null,"",0]
[null,null,4883,"",null,null,null,"",0]
[null,null,4884,"",null,null,null,"",0]
[null,null,4885,"",null,null,null,"",0]
[null,null,4886,"",null,null,null,"",0]
[null,null,4887,"",null,null,null,"",0]
[null,null,4888,"",null,null,null,"",0]
[null,null,4889,"",null,null,null,"",0]
[null,null,4890,"",null,null,null,"",0]
[null,null,4891,"",null,null,null,"",0]
[null,null,4892,"",null,null,null,"",0]
[null,null,4893,"",null,null,null,"",0]
[null,null,4894,"",null,null,null,"",0]
[null,null,4895,"",null,null,null,"",0]
[null,null,4896,"",null,null,null,"",0]
[null,null,4897,"",null,null,null,"",0]
[null,null,4898,"",null,null,null,"",0]
[null,null,4899,"",null,null,null,"",0]
[null,null,4900,"",null,null,null,"",0]
[null,null,4901,"",null,null,null,"",0]
[null,null,4902,"",null,null,null,"",0]
[null,null,4903,"",null,null,null,"",0]
[null,null,4904,"",null,null,null,"",0]
[null,null,4905,"",null,null,null,"",0]
[null,null,4906,"",null,null,null,"",0]
[null,null,4907,"",null,null,null,"",0]
[null,null,4908,"",null,null,null,"",0]
[null,null,4909,"",null,null,null,"",0]
[null,null,4910,"",null,null,null,"",0]
[null,null,4911,"",null,null,null,"",0]
[null,null,4912,"",null,null,null,"",0]
[null,null,4913,"",null,null,null,"",0]
[null,null,4914,"",null,null,null,"",0]
[null,null,4915,"",null,null,null,"",0]
[null,null,4916,"",null,null,null,"",0]
[null,null,4917,"",null,null,null,"",0]
[null,null,4918,"",null,null,null,"",0]
[null,null,4919,"",null,null,null,"",0]
[null,null,4920,"",null,null,null,"",0]
[null,null,4921,"",null,null,null,"",0]
[null,null,4922,"",null,null,null,"",0]
[null,null,4923,"",null,null,null,"",0]
[null,null,4924,"",null,null,null,"",0]
[null,null,4925,"",null,null,null,"",0]
[null,null,4926,"",null,null,null,"",0]
[null,null,4927,"",null,null,null,"",0]
[null,null,4928,"",null,null,null,"",0]
[null,null,4929,"",null,null,null,"",0]
[null,null,4930,"",null,null,null,"",0]
[null,null,4931,"",null,null,null,"",0]
[null,null,4932,"",null,null,null,"",0]
[null,null,4933,"",null,null,null,"",0]
[null,null,4934,"",null,null,null,"",0]
[null,null,4935,"",null,null,null,"",0]
[null,null,4936,"",null,null,null,"",0]
[null,null,4937,"",null,null,null,"",0]
[null,null,4938,"",null,null,null,"",0]
[null,null,4939,"",null,null,null,"",0]
[null,null,4940,"",null,null,null,"",0]
[null,null,4941,"",null,null,null,"",0]
[null,null,4942,"",null,null,null,"",0]
[null,null,4943,"",null,null,null,"",0]
[null,null,4944,"",null,null,null,"",0]
[null,null,4945,"",null,null,null,"",0]
[null,null,4946,"",null,null,null,"",0]
[null,null,4947,"",null,null,null,"",0]
[null,null,4948,"",null,null,null,"",0]
[null,null,4949,"",null,null,null,"",0]
[null,null,4950,"",null,null,null,"",0]
[null,null,4951,"",null,null,null,"",0]
[null,null,4952,"",null,null,null,"",0]
[null,null,4953,"",null,null,null,"",0]
[null,null,4954,"",null,null,null,"",0]
[null,null,4955,"",null,null,null,"",0]
[null,null,4956,"",null,null,null,"",0]
[null,null,4957,"",null,null,null,"",0]
[null,null,4958,"",null,null,null,"",0]
[null,null,4959,"",null,null,null,"",0]
[null,null,4960,"",null,null,null,"",0]
[null,null,4961,"",null,null,null,"",0]
[null,null,4962,"",null,null,null,"",0]
[null,null,4963,"",null,null,null,"",0]
[null,null,4964,"",null,null,null,"",0]
[null,null,4965,"",null,null,null,"",0]
[null,null,4966,"",null,null,null,"",0]
[null,null,4967,"",null,null,null,"",0]
[null,null,4968,"",null,null,null,"",0]
[null,null,4969,"",null,null,null,"",0]
[null,null,4970,"",null,null,null,"",0]
[null,null,4971,"",null,null,null,"",0]
[null,null,4972,"",null,null,null,"",0]
[null,null,4973,"",null,null,null,"",0]
[null,null,4974,"",null,null,null,"",0]
[null,null,4975,"",null,null,null,"",0]
[null,null,4976,"",null,null,null,"",0]
[null,null,4977,"",null,null,null,"",0]
[null,null,4978,"",null,null,null,"",0]
[null,null,4979,"",null,null,null,"",0]
[null,null,4980,"",null,null,null,"",0]
[null,null,4981,"",null,null,null,"",0]
[null,null,4982,"",null,null,null,"",0]
[null,null,4983,"",null,null,null,"",0]
[null,null,4984,"",null,null,null,"",0]
[null,null,4985,"",null,null,null,"",0]
[null,null,4986,"",null,null,null,"",0]
[null,null,4987,"",null,null,null,"",0]
[null,null,4988,"",null,null,null,"",0]
[null,null,4989,"",null,null,null,"",0]
[null,null,4990,"",null,null,null,"",0]
[null,null,4991,"",null,null,null,"",0]
[null,null,4992,"",null,null,null,"",0]
[null,null,4993,"",null,null,null,"",0]
[null,null,4994,"",null,null,null,"",0]
[null,null,4995,"",null,null,null,"",0]
[null,null,4996,"",null,null,null,"",0]
[null,null,4997,"",null,null,null,"",0]
[null,null,4998,"",null,null,null,"",0]
[null,null,4999,"",null,null,null,"",0]
[null,null,5000,"",null,null,null,"",0]
[]
[null,null,176]
[]
[]
[]
[]
[]
[]
[null,"Note 7:","Analysis of ranking liabilities relating to futures & unlisted options contracts"]
[null,null,null,null,null,null,null,null,"(HK$'000)"]
[null,null,null,"For house account",null,null,null,null,0,"[1112A]"]
[null,null,null,"For client account (i.e. margin shortfall)",null,null,null,null,0,"[1112B]"]
[]
[]
[]
[]
[null,"Note 8:","Analysis of shareholders' funds",null,"section ref.",null,null,null,"(HK$'000)"]
[null,null,null,"Paid-up share capital",5,null,null,null,0,"[1113]"]
[]
[null,null,null,"Retained profits/(accumulated losses)",null,null,null,null,0,"[1114]"]
[]
[null,null,null,"Other reserves",null,null,null,null,0,"[1115]"]
[]
[]
[]
[null,null,null,"Amounts included in cell 1106",null,null,null,null,{"$f":"I5188+I5190+I5192","v":0},"[1116]"]

{"sheet":"Declaration","index":3,"n_rows":45,"n_cols":10,"rows_kept":45,"cut":false,"hidden":false,"merged":[[44,2,45,7],[0,0,0,4],[4,1,4,7],[42,2,43,7],[31,2,31,3],[5,2,5,7]]}
[{"$f":"IF(ISBLANK('Form 1 Main'!G14),\"\",\"Financial return of\")&\" \"&IF(ISBLANK('Form 1 Main'!G14),\"\",'Form 1 Main'!G14)&\" as of the end of reporting month \"&IF(ISBLANK('Form 1 Main'!L21),\"\",'Form 1 Main'!L21)","v":"Financial return of  as of the end of reporting month "},null,null,null,null,null,null,null,{"$f":"IF(ISBLANK(Config!C7),\"\",Config!C7)","v":""}]
[null,"DECLARATION"]
[]
[]
[null,"I certify that the information in the following entries, returns, analyses or reports is true and correct to the best of my knowledge and belief.  I also confirm that where I have left blank any entry, return, analysis or report, this signifies a nil return or that the entry, return, analysis or report will not be applicable:"]
[]
[null,null,null,null,null,null,"(Select where appropriate)"]
[null,null,"Forms to be submitted on monthly basis: (Note 1)"]
[null,null,"Form 1","Liquid capital computation",null,null,null,"[1117]",null,"N"]
[null,null,"Form 2","Required liquid capital computation",null,null,null,"[1118]",null,"N"]
[null,null,"Form 3","Credit facility summary",null,null,null,"[1119]",null,"N"]
[null,null,"Form 4","Margin client analysis",null,null,null,"[1120]",null,"N"]
[null,null,"Form 5","Analysis of securities collateral",null,null,null,"[1121]",null,"N"]
[null,null,"Form 6","Rolling balance cash client analysis",null,null,null,"[1122]",null,"N"]
[null,null,"Form 7","Profit and loss account",null,null,null,"[1123]",null,"N"]
[null,null,"Form 8","Analysis of client assets",null,null,null,"[1124]",null,"N"]
[null,null,"Form 9","Foreign currency position of licensed corporation",null,null,null,"[1125]",null,"N"]
[null,null,null,"   licensed for leveraged foreign exchange trading"]
[]
[]
[null,null,"Forms to be submitted on quarterly basis together with monthly financial"]
[null,null,"return for March, June, September and December: (Note 1)"]
[]
[null,null,"Form 10","Report on proprietary derivative positions",null,null,null,"[1126]",null,"N"]
[null,null,"Form 11","List of recognized counterparties",null,null,null,"[1127]",null,"N"]
[null,null,"Form 12","Clientele and assets under management",null,null,null,"[1128]",null,"N"]
[]
[]
[]
[]
[null,null,"Name of the person who signs the return electronically (Note 2):"]
[null,null,"",null,"[1130]"]
[]
[null,null,"Capacity*: "]
[null,null,null,null,null,null,null,"[1131]"]
[]
[null,null,"Date: (dd/mmm/yyyy e.g 01/Jan/2009)"]
[null,null,null,"[1132]"]
[]
[null,"      * Select where appropriate"]
[]
[]
[null,"Note 1:  ","A licensed corporation licensed for one or more of the regulated activities of advising on securities, advising on futures contracts, advising on corporate finance, providing asset management and/or providing credit rating services and where the licensed corporation is subject to specified licensing condition should submit Forms 1, 2, 7 and 12 on semi-annual basis."]
[]
[null,"Note 2:  ","State the name of the person who signs the return electronically in the manner required by section 56(6) of the Securities and Futures (Financial Resources) Rules."]

{"sheet":"Form 2","index":4,"n_rows":59,"n_cols":15,"rows_kept":59,"cut":false,"hidden":false,"merged":[[12,10,13,10],[15,10,17,10],[18,10,19,10],[23,10,24,10],[19,4,19,7],[36,4,36,7],[37,4,37,7],[38,4,38,8],[39,4,39,8],[5,8,5,9],[35,4,35,7],[30,4,30,7],[23,4,23,8],[23,11,24,11],[55,13,57,13],[49,10,50,10],[49,11,50,11],[51,10,54,10],[51,11,54,11],[25,11,28,11],[31,11,32,11],[25,10,28,10],[31,10,32,10],[33,10,35,10],[2,12,2,13],[18,11,19,11],[7,12,9,12],[12,11,13,11],[15,11,17,11],[7,13,9,13],[58,12,59,12],[58,13,59,13],[44,11,45,11],[40,4,40,8],[44,10,45,10],[41,4,41,7],[55,12,57,12]]}
[{"$f":"IF(ISBLANK('Form 1 Main'!G14),\"\",\"Financial return of\")&\" \"&IF(ISBLANK('Form 1 Main'!G14),\"\",'Form 1 Main'!G14)","v":"Financial return of "},null,null,null,null,null,null,null,null,null,null,null,null,""]
[null,"FORM 2",null,null,"REQUIRED LIQUID CAPITAL COMPUTATION"]
[null,null,null,null,"AS OF THE END OF REPORTING MONTH",null,null,null,null,null,null,{"$f":"IF(ISBLANK('Form 1 Main'!L21),\"\",'Form 1 Main'!L21)","v":""},"[1004]"]
[]
[]
[null,null,null,null,null,null,null,null,"section ref.",null,null,null,"(HK$'000)"]
[null,null,null,null,null,null,null,null,null,null,null,null,null,null,{"$f":"IF(OR('Form 1 Main'!L45=\"Y\",'Form 1 Main'!L49=\"Y\",'Form 1 Main'!L53=\"Y\",'Form 1 Main'!L54=\"Y\",'Form 1 Main'!L67=\"Y\",'Form 1 Main'!L71=\"Y\"),100,0)","v":0}]
[null,null,"(I) ","  Floor requirement: HK$100,000, HK$500,000, HK$3,000,000",null,null,null,null,"Table 2 in Schedule 1",null,null,null,{"$f":"MAX(O7:O10)","v":0},"[2000]",{"$f":"IF('Form 1 Main'!L41=\"Y\",15000,0)","v":0}]
[null,null,null,"    or HK$15,000,000 (A)",null,null,null,null,null,null,null,null,null,null,{"$f":"IF(OR('Form 1 Main'!L31=\"Y\",'Form 1 Main'!L32=\"Y\",'Form 1 Main'!L36=\"Y\",'Form 1 Main'!L37=\"Y\",'Form 1 Main'!L38=\"Y\"),500,0)","v":0}]
[null,null,null,null,null,null,null,null,null,null,null,null,null,null,{"$f":"IF(OR('Form 1 Main'!L29=\"Y\",'Form 1 Main'!L30=\"Y\",'Form 1 Main'!L35=\"Y\",'Form 1 Main'!L42=\"Y\",'Form 1 Main'!L46=\"Y\",'Form 1 Main'!L50=\"Y\",'Form 1 Main'!L56=\"Y\",'Form 1 Main'!L57=\"Y\",'Form 1 Main'!L61=\"Y\",'Form 1 Main'!L64=\"Y\",'Form 1 Main'!L68=\"Y\",'Form 1 Main'!L72=\"Y\"),3000,0)","v":0}]
[null,null,"(II)","  Variable required liquid capital",null,null,null,null,"2",null,null,"(HK$'000)"]
[]
[null,null,null,"  On-balance sheet liabilities including provisions made for",null,null,null,null,null,null,"[2001]",0]
[null,null,null,"    liabilities already incurred or for contingent liabilities (B)"]
[null,null,null,"  Less: ","Accounts payable to clients for:"]
[null,null,null,null,"- client money held in segregated accounts in ",null,null,null,null,null,"[2002]",0]
[null,null,null,null,"  accordance with Securities & Futures (Client"]
[null,null,null,null,"  Money) Rules (C)"]
[null,null,null,null,"- other client money held in segregated accounts with",null,null,null,null,null,"[2003]",0]
[null,null,null,null,"  authorized financial institutions and/or with approved \n  banks incorporated outside Hong Kong (D)"]
[]
[]
[]
[null,null,null,null,"- client money held in segregated accounts with",null,null,null,null,null,"[2004]",0]
[null,null,null,null,"  futures or options clearing houses (E)"]
[null,null,null,null,"- client money held by clearing houses other than futures",null,null,null,null,null,"[2005]",0]
[null,null,null,null,"  or options clearing houses, clearing participants, futures"]
[null,null,null,null,"  dealers or securities dealers as margin (F)"]
[]
[null,null,null,null,"Approved subordinated loan (G)",null,null,null,null,null,"[2006]",0]
[null,null,null,null,"Amount of liabilities arising from tenancy agreement \n entered into in respect of the premises the licensed\n corporation used in carrying on regulated activity for \n which it is licensed; and is equal to the total value of its \n assets arising from the tenancy agreement which are\n not included in its liquid assets under any provision in \n Division 3 of Part 4 of the Securities and Futures \n (Financial Resources) Rules (H)",null,null,null,null,null,"[2006A]",0]
[null,null,null,"  Adjusted liabilities (I) = (B) - (C) - (D) - (E) - (F) - (G) - (H)",null,null,null,null,"2",null,"[2007]",{"$f":"IF(L13-L16-L19-L24-L26-L30-L31>0,L13-L16-L19-L24-L26-L30-L31,0)","v":0}]
[]
[null,null,null,"  Add:","Aggregate of initial margin requirements and "]
[null,null,null,null," amounts of margin required to be deposited in "]
[null,null,null,null," respect of outstanding futures and unlisted options \n contracts held on behalf of clients:"]
[null,null,null,null," (a) Futures and unlisted options contracts (excluding  \n       stock options contracts) traded on "]
[null,null,null,null,"   - Hong Kong Futures Exchange Limited (J)",null,null,null,null,null,"[2008A]",0]
[null,null,null,null,"   - other markets (K)",null,null,null,null,null,"[2008B]",0]
[null,null,null,null," (b) Stock options contracts traded on "]
[null,null,null,null,"   - the Stock Exchange of Hong Kong Limited (L)",null,null,null,null,null,"[2008C]",0]
[null,null,null,null,"   - other markets (M)",null,null,null,null,null,"[2008D]",0]
[]
[]
[null,null,null,"  Aggregate of adjusted liabilities and clients' margin",null,null,null,null,null,null,"[2009]",{"$f":"L32+L38+L39+L41+L42","v":0}]
[null,null,null,"  (N) = (I) + (J) + (K) + (L) + (M)"]
[]
[]
[]
[null,null,null,"  Basic amount (O) = (N) x 5%",null,null,null,null,"2",null,"[2010]",{"$f":"ROUND(L45*0.05,0)","v":0}]
[]
[null,null,null,"  Add:","1.5% of aggregate gross foreign currency position for",null,null,null,null,null,"[2011]",0]
[null,null,null,null," licensed corporation licensed for leveraged foreign"]
[null,null,null,null," exchange trading (P)"]
[]
[null,null,null,"  Variable required liquid capital (Q) = (O) + (P)",null,null,null,null,null,null,null,null,{"$f":"L50+L52","v":0},"[2012]"]
[]
[]
[null,null,"(III)","  Required liquid capital (being the higher of (A) and (Q))",null,null,null,null,"2",null,null,null,0,"[2013]"]

{"sheet":"Form 3","index":5,"n_rows":85,"n_cols":17,"rows_kept":85,"cut":false,"hidden":false,"merged":[[22,12,22,13],[1,10,1,11],[5,5,5,8],[19,12,19,13],[20,12,20,13],[21,12,21,13],[4,3,4,4],[5,10,5,13],[10,12,10,13],[18,12,18,13],[15,12,15,13],[16,12,16,13],[17,12,17,13],[9,12,9,13],[5,3,5,4],[13,12,13,13],[14,12,14,13],[12,12,12,13],[8,12,8,13],[7,12,7,13],[11,12,11,13],[87,4,87,15],[71,4,71,15],[78,5,78,7],[78,8,78,12],[82,5,82,7],[82,8,82,12],[76,3,76,15],[79,3,79,15],[80,3,80,15],[85,3,85,15],[74,3,74,15],[75,3,75,15],[72,3,72,15],[84,3,84,15],[73,3,73,15],[27,12,27,13],[26,12,26,13],[23,12,23,13],[32,12,32,13],[28,12,28,13],[29,12,29,13],[30,12,30,13],[31,12,31,13],[25,12,25,13],[24,12,24,13],[33,12,33,13],[44,12,44,13],[53,12,53,13],[49,12,49,13],[45,12,45,13],[34,12,34,13],[35,12,35,13],[36,12,36,13],[37,12,37,13],[38,12,38,13],[39,12,39,13],[46,12,46,13],[47,12,47,13],[48,12,48,13],[40,12,40,13],[41,12,41,13],[42,12,42,13],[43,12,43,13],[64,3,64,15],[62,13,62,14],[54,12,54,13],[50,12,50,13],[51,12,51,13],[52,12,52,13],[59,12,59,13],[56,12,56,13],[57,12,57,13],[55,12,55,13],[59,3,59,4],[58,12,58,13],[63,13,63,14],[66,3,66,15],[67,3,67,15],[68,3,68,15],[69,3,69,15],[70,3,70,15]]}
[{"$f":"IF(ISBLANK('Form 1 Main'!G14),\"\",\"Financial return of\")&\" \"&IF(ISBLANK('Form 1 Main'!G14),\"\",'Form 1 Main'!G14)","v":"Financial return of "},null,null,null,null,null,null,null,null,null,null,null,null,null,null,null,{"$f":"IF(ISBLANK(Config!C7),\"\",Config!C7)","v":""}]
[null,"FORM 3",null,null,"CREDIT FACILITY SUMMARY AS OF THE END OF REPORTING MONTH",null,null,null,null,null,{"$f":"IF(ISBLANK('Form 1 Main'!L21),\"\",'Form 1 Main'!L21)","v":""},null,"[1004]"]
[]
[]
[]
[null,null,null,"Name of financial institution\n(Note 3)",null,"Type of credit facility and limit\n(Note 4)",null,null,null,"Amount drawn or utilized by the licensed corporation\n(Note 1)","Type of security provided\n(Note 5)",null,null,null,"Market value of security provided","Acceptable discounted value of security provided\n(Note 6)"]
[]
[null,null,"Credit facility group (Note 2)","Code of financial institution","Name","Credit facility code","Nature","Maturity or expiry date","Limit",null,"Security code","Type","Name of provider and its relationship with the licensed corporation"]
[null,"Row",null,null,null,null,null,"(dd/mm/yyyy)\n","(HK$'000)\n","(HK$'000)\n",null,null,null,null,"(HK$'000)\n","(HK$'000)\n","Row"]
[null,"[1]",null,"","","","","",0,0,"","","",null,0,0,"[1]"]
[null,"[2]",null,"","","","","",0,0,"","","",null,0,0,"[2]"]
[null,"[3]",null,"","","","","",0,0,"","","",null,0,0,"[3]"]
[null,"[4]",null,"","","","","",0,0,"","","",null,0,0,"[4]"]
[null,"[5]",null,"","","","","",0,0,"","","",null,0,0,"[5]"]
[null,"[6]",null,"","","","","",0,0,"","","",null,0,0,"[6]"]
[null,"[7]",null,"","","","","",0,0,"","","",null,0,0,"[7]"]
[null,"[8]",null,"","","","","",0,0,"","","",null,0,0,"[8]"]
[null,"[9]",null,"","","","","",0,0,"","","",null,0,0,"[9]"]
[null,"[10]",null,"","","","","",0,0,"","","",null,0,0,"[10]"]
[null,"[11]",null,"","","","","",0,0,"","","",null,0,0,"[11]"]
[null,"[12]",null,"","","","","",0,0,"","","",null,0,0,"[12]"]
[null,"[13]",null,"","","","","",0,0,"","","",null,0,0,"[13]"]
[null,"[14]",null,"","","","","",0,0,"","","",null,0,0,"[14]"]
[null,"[15]",null,"","","","","",0,0,"","","",null,0,0,"[15]"]
[null,"[16]",null,"","","","","",0,0,"","","",null,0,0,"[16]"]
[null,"[17]",null,"","","","","",0,0,"","","",null,0,0,"[17]"]
[null,"[18]",null,"","","","","",0,0,"","","",null,0,0,"[18]"]
[null,"[19]",null,"","","","","",0,0,"","","",null,0,0,"[19]"]
[null,"[20]",null,"","","","","",0,0,"","","",null,0,0,"[20]"]
[null,"[21]","","","","","","",0,0,"","","",null,0,0,"[21]"]
[null,"[22]","","","","","","",0,0,"","","",null,0,0,"[22]"]
[null,"[23]","","","","","","",0,0,"","","",null,0,0,"[23]"]
[null,"[24]","","","","","","",0,0,"","","",null,0,0,"[24]"]
[null,"[25]","","","","","","",0,0,"","","",null,0,0,"[25]"]
[null,"[26]","","","","","","",0,0,"","","",null,0,0,"[26]"]
[null,"[27]","","","","","","",0,0,"","","",null,0,0,"[27]"]
[null,"[28]","","","","","","",0,0,"","","",null,0,0,"[28]"]
[null,"[29]","","","","","","",0,0,"","","",null,0,0,"[29]"]
[null,"[30]","","","","","","",0,0,"","","",null,0,0,"[30]"]
[null,"[31]","","","","","","",0,0,"","","",null,0,0,"[31]"]
[null,"[32]","","","","","","",0,0,"","","",null,0,0,"[32]"]
[null,"[33]","","","","","","",0,0,"","","",null,0,0,"[33]"]
[null,"[34]","","","","","","",0,0,"","","",null,0,0,"[34]"]
[null,"[35]","","","","","","",0,0,"","","",null,0,0,"[35]"]
[null,"[36]","","","","","","",0,0,"","","",null,0,0,"[36]"]
[null,"[37]","","","","","","",0,0,"","","",null,0,0,"[37]"]
[null,"[38]","","","","","","",0,0,"","","",null,0,0,"[38]"]
[null,"[39]","","","","","","",0,0,"","","",null,0,0,"[39]"]
[null,"[40]","","","","","","",0,0,"","","",null,0,0,"[40]"]
[null,"[41]","","","","","","",0,0,"","","",null,0,0,"[41]"]
[null,"[42]","","","","","","",0,0,"","","",null,0,0,"[42]"]
[null,"[43]","","","","","","",0,0,"","","",null,0,0,"[43]"]
[null,"[44]","","","","","","",0,0,"","","",null,0,0,"[44]"]
[null,"[45]","","","","","","",0,0,"","","",null,0,0,"[45]"]
[null,"[46]","","","","","","",0,0,"","","",null,0,0,"[46]"]
[null,"[47]","","","","","","",0,0,"","","",null,0,0,"[47]"]
[null,"[48]","","","","","","",0,0,"","","",null,0,0,"[48]"]
[null,"[49]","","","","","","",0,0,"","","",null,0,0,"[49]"]
[null,"[50]","","","","","","",0,0,"","","",null,0,0,"[50]"]
[null,null,null,"Total",null,null,null,"[3000]",{"$f":"SUM(I10:I59)","v":0},{"$f":"SUM(J10:J59)","v":0},"[3001]",null,"[3002]",null,{"$f":"SUM(O10:O59)","v":0},{"$f":"SUM(P10:P59)","v":0},"[3003]"]
[]
[]
[null,null,"Note 1:","(a)  Total loans drawn or utilized by the licensed corporation which were wholly or partly secured by collateral provided by margin clients:",null,null,null,null,null,null,null,null,"HK$",0,null,"('000) [3004]"]
[null,null,null,"(b)  Total market value of margin client securities re-pledged",null,null,null,null,null,null,null,null,"HK$",{"$f":"SUMIFS(O10:O59,K10:K59,\"=8a\")","v":0},null,"('000) [3005]"]
[null,null,null,"(c)  Total loans and overdrafts from authorized financial institutions or from other financial institutions reported in this form should respectively equal to cell 1076 or cell 1078 of the \n       balance sheet in Form 1.  "]
[]
[null,null,"Note 2:","Please assign group number to each credit facility in ascending order (i.e. input \"1\" for group 1, \"2\" for group 2 and so on) in accordance with the following:"]
[null,null,null,"(a)  each credit facility should be reported in separate row and assigned an unique group number;"]
[null,null,null,"(b)  where one credit facility is secured by more than one type of security, each type of security should be reported in a separate row and the rows in question should be assigned\n       with a common group number; "]
[null,null,null,"(c)  where one type of security is used to secure more than one credit facility, each credit facility should be reported in a separate row and the rows in question should be assigned \n       with a common group number; and/or"]
[null,null,null,"(d)  where one group of credit facilities is secured by different types of securities, please report each credit facility and each type of security in a separate row and the rows in \n       question should be assigned with a common group number."]
[]
[null,null,"Note 3:","(a)  For the purpose of this form, financial institutions include authorized financial institutions and other financial institutions such as licensed corporations, licensed providers, overseas\n       banks and overseas securities dealers. "]
[null,null,null,"(b)  Licensed corporation should select the code of financial institution from the pull-down menu.  If name of the financial institution is not available from the pull-down \n      menu, please select code of financial institution \"901\", \"902\" or \"920\" as appropriate and specify the name of the financial institution in the space provided.\n"]
[]
[null,null,"Note 4:","Licensed corporation should select the credit facility code from the pull-down menu.  If nature of the credit facility is not available from the pull-down menu, \nplease select credit facility code \"99a\" or \"99b\" as appropriate and specify the nature of the credit facility in the space provided. "]
[]
[]
[]
[null,null,"Note 5:","Licensed corporation should select the security code from the pull-down menu.  If type of the security is not available from the pull-down menu, \nplease select security code \"99\" and specify the type of the security in the space provided."]
[]
[]
[]
[]
[null,null,"Note 6:","Being the amount of credit facility which the financial institution is prepared to extend against the security provided."]

{"sheet":"Form 4 Table 1","index":6,"n_rows":1030,"n_cols":18,"rows_kept":1030,"cut":false,"hidden":false,"merged":[[3,9,3,10],[9,8,9,10],[9,11,9,13],[9,14,9,16],[8,8,8,16],[9,6,10,6],[1017,2,1017,15],[1018,2,1018,15],[9,7,10,7],[1019,2,1019,15],[1016,2,1016,16],[1021,2,1021,16],[1029,2,1029,16],[1030,2,1030,15],[1024,3,1024,4],[1025,3,1025,4],[1026,3,1026,4],[1027,3,1027,4],[1022,2,1022,16]]}
[{"$f":"IF(ISBLANK('Form 1 Main'!G14),\"\",\"Financial return of\")&\" \"&IF(ISBLANK('Form 1 Main'!G14),\"\",'Form 1 Main'!G14)","v":"Financial return of "},null,null,null,null,null,null,null,null,null,null,null,null,null,null,null,{"$f":"IF(ISBLANK(Config!C7),\"\",Config!C7)","v":""}]
[null,"FORM 4   MARGIN CLIENT ANALYSIS"]
[]
[null,"Table 1    By unadjusted loan balance as of the end of reporting month",null,null,null,null,null,null,null,{"$f":"IF(ISBLANK('Form 1 Main'!L21),\"\",'Form 1 Main'!L21)","v":""},null,"[1004]","(Note 1)"]
[]
[]
[null,"Top margin clients ranked in descending order of the unadjusted loan balance as of the end of reporting month (Note 2)"]
[]
[null,null,null,null,null,null,null,null,"Top 3 collateral (Note 3)"]
[null,null,null,null,null,null,"Adjusted loan balance \n(Note 1) \n(HK$'000)\n","Loan to collateral ratio\n(%)\n(C)=(A)/(B)","Collateral 1",null,null,"Collateral 2",null,null,"Collateral 3"]
[null,"Row","Name of client\n","Ranking","Unadjusted loan balance \n(HK$'000) \n(A)","Collateral market value \n(HK$'000)\n(B)",null,null,"Name\n","Stock code / sedol no. / ISIN code\n","Market value\n (HK$'000)\n","Name\n","Stock code / sedol no. / ISIN code\n","Market value \n(HK$'000)\n","Name\n","Stock code / sedol no. / ISIN code\n","Market value \n(HK$'000)\n","Row"]
[null,"[1]","",1,0,0,0,{"$f":"IF(F12=0,0,(E12/F12)*100)","v":0},"","",0,"","",0,"","",0,"[1]"]
[null,"[2]","",2,0,0,0,0,"","",0,"","",0,"","",0,"[2]"]
[null,"[3]","",3,0,0,0,0,"","",0,"","",0,"","",0,"[3]"]
[null,"[4]","",4,0,0,0,0,"","",0,"","",0,"","",0,"[4]"]
[null,"[5]","",5,0,0,0,0,"","",0,"","",0,"","",0,"[5]"]
[null,"[6]","",6,0,0,0,0,"","",0,"","",0,"","",0,"[6]"]
[null,"[7]","",7,0,0,0,0,"","",0,"","",0,"","",0,"[7]"]
[null,"[8]","",8,0,0,0,0,"","",0,"","",0,"","",0,"[8]"]
[null,"[9]","",9,0,0,0,0,"","",0,"","",0,"","",0,"[9]"]
[null,"[10]","",10,0,0,0,0,"","",0,"","",0,"","",0,"[10]"]
[null,"[11]","",11,0,0,0,0,"","",0,"","",0,"","",0,"[11]"]
[null,"[12]","",12,0,0,0,0,"","",0,"","",0,"","",0,"[12]"]
[null,"[13]","",13,0,0,0,0,"","",0,"","",0,"","",0,"[13]"]
[null,"[14]","",14,0,0,0,0,"","",0,"","",0,"","",0,"[14]"]
[null,"[15]","",15,0,0,0,0,"","",0,"","",0,"","",0,"[15]"]
[null,"[16]","",16,0,0,0,0,"","",0,"","",0,"","",0,"[16]"]
[null,"[17]","",17,0,0,0,0,"","",0,"","",0,"","",0,"[17]"]
[null,"[18]","",18,0,0,0,0,"","",0,"","",0,"","",0,"[18]"]
[null,"[19]","",19,0,0,0,0,"","",0,"","",0,"","",0,"[19]"]
[null,"[20]","",20,0,0,0,0,"","",0,"","",0,"","",0,"[20]"]
[null,"[21]","",21,0,0,0,0,"","",0,"","",0,"","",0,"[21]"]
[null,"[22]","",22,0,0,0,0,"","",0,"","",0,"","",0,"[22]"]
[null,"[23]","",23,0,0,0,0,"","",0,"","",0,"","",0,"[23]"]
[null,"[24]","",24,0,0,0,0,"","",0,"","",0,"","",0,"[24]"]
[null,"[25]","",25,0,0,0,0,"","",0,"","",0,"","",0,"[25]"]
[null,"[26]","",26,0,0,0,0,"","",0,"","",0,"","",0,"[26]"]
[null,"[27]","",27,0,0,0,0,"","",0,"","",0,"","",0,"[27]"]
[null,"[28]","",28,0,0,0,0,"","",0,"","",0,"","",0,"[28]"]
[null,"[29]","",29,0,0,0,0,"","",0,"","",0,"","",0,"[29]"]
[null,"[30]","",30,0,0,0,0,"","",0,"","",0,"","",0,"[30]"]
[null,"[31]","",31,0,0,0,0,"","",0,"","",0,"","",0,"[31]"]
[null,"[32]","",32,0,0,0,0,"","",0,"","",0,"","",0,"[32]"]
[null,"[33]","",33,0,0,0,0,"","",0,"","",0,"","",0,"[33]"]
[null,"[34]","",34,0,0,0,0,"","",0,"","",0,"","",0,"[34]"]
[null,"[35]","",35,0,0,0,0,"","",0,"","",0,"","",0,"[35]"]
[null,"[36]","",36,0,0,0,0,"","",0,"","",0,"","",0,"[36]"]
[null,"[37]","",37,0,0,0,0,"","",0,"","",0,"","",0,"[37]"]
[null,"[38]","",38,0,0,0,0,"","",0,"","",0,"","",0,"[38]"]
[null,"[39]","",39,0,0,0,0,"","",0,"","",0,"","",0,"[39]"]
[null,"[40]","",40,0,0,0,0,"","",0,"","",0,"","",0,"[40]"]
[null,"[41]","",41,0,0,0,0,"","",0,"","",0,"","",0,"[41]"]
[null,"[42]","",42,0,0,0,0,"","",0,"","",0,"","",0,"[42]"]
[null,"[43]","",43,0,0,0,0,"","",0,"","",0,"","",0,"[43]"]
[null,"[44]","",44,0,0,0,0,"","",0,"","",0,"","",0,"[44]"]
[null,"[45]","",45,0,0,0,0,"","",0,"","",0,"","",0,"[45]"]
[null,"[46]","",46,0,0,0,0,"","",0,"","",0,"","",0,"[46]"]
[null,"[47]","",47,0,0,0,0,"","",0,"","",0,"","",0,"[47]"]
[null,"[48]","",48,0,0,0,0,"","",0,"","",0,"","",0,"[48]"]
[null,"[49]","",49,0,0,0,0,"","",0,"","",0,"","",0,"[49]"]
[null,"[50]","",50,0,0,0,0,"","",0,"","",0,"","",0,"[50]"]
[null,"[51]","",null,0,0,0,0,"","",0,"","",0,"","",0,"[51]"]
[null,"[52]","",null,0,0,0,0,"","",0,"","",0,"","",0,"[52]"]
[null,"[53]","",null,0,0,0,0,"","",0,"","",0,"","",0,"[53]"]
[null,"[54]","",null,0,0,0,0,"","",0,"","",0,"","",0,"[54]"]
[null,"[55]","",null,0,0,0,0,"","",0,"","",0,"","",0,"[55]"]
[null,"[56]","",null,0,0,0,0,"","",0,"","",0,"","",0,"[56]"]
[null,"[57]","",null,0,0,0,0,"","",0,"","",0,"","",0,"[57]"]
[null,"[58]","",null,0,0,0,0,"","",0,"","",0,"","",0,"[58]"]
[null,"[59]","",null,0,0,0,0,"","",0,"","",0,"","",0,"[59]"]
[null,"[60]","",null,0,0,0,0,"","",0,"","",0,"","",0,"[60]"]
[null,"[61]","",null,0,0,0,0,"","",0,"","",0,"","",0,"[61]"]
[null,"[62]","",null,0,0,0,0,"","",0,"","",0,"","",0,"[62]"]
[null,"[63]","",null,0,0,0,0,"","",0,"","",0,"","",0,"[63]"]
[null,"[64]","",null,0,0,0,0,"","",0,"","",0,"","",0,"[64]"]
[null,"[65]","",null,0,0,0,{"$f":"IF(F76=0,0,(E76/F76)*100)","v":0},"","",0,"","",0,"","",0,"[65]"]
[null,"[66]","",null,0,0,0,0,"","",0,"","",0,"","",0,"[66]"]
[null,"[67]","",null,0,0,0,0,"","",0,"","",0,"","",0,"[67]"]
[null,"[68]","",null,0,0,0,0,"","",0,"","",0,"","",0,"[68]"]
[null,"[69]","",null,0,0,0,0,"","",0,"","",0,"","",0,"[69]"]
[null,"[70]","",null,0,0,0,0,"",null,0,"",null,0,"",null,0,"[70]"]
[null,"[71]","",null,0,0,0,0,"","",0,"","",0,"","",0,"[71]"]
[null,"[72]","",null,0,0,0,0,"","",0,"","",0,"","",0,"[72]"]
[null,"[73]","",null,0,0,0,0,"","",0,"","",0,"","",0,"[73]"]
[null,"[74]","",null,0,0,0,0,"","",0,"","",0,"","",0,"[74]"]
[null,"[75]","",null,0,0,0,0,"","",0,"","",0,"","",0,"[75]"]
[null,"[76]","",null,0,0,0,0,"","",0,"","",0,"","",0,"[76]"]
[null,"[77]","",null,0,0,0,0,"","",0,"","",0,"","",0,"[77]"]
[null,"[78]","",null,0,0,0,0,"","",0,"","",0,"","",0,"[78]"]
[null,"[79]","",null,0,0,0,{"$f":"IF(F90=0,0,(E90/F90)*100)","v":0},"","",0,"","",0,"","",0,"[79]"]
[null,"[80]","",null,0,0,0,{"$f":"IF(F91=0,0,(E91/F91)*100)","v":0},"","",0,"","",0,"","",0,"[80]"]
[null,"[81]","",null,0,0,0,0,"","",0,"","",0,"","",0,"[81]"]
[null,"[82]","",null,0,0,0,0,"","",0,"","",0,"","",0,"[82]"]
[null,"[83]","",null,0,0,0,0,"","",0,"","",0,"","",0,"[83]"]
[null,"[84]","",null,0,0,0,0,"","",0,"","",0,"","",0,"[84]"]
[null,"[85]","",null,0,0,0,0,"","",0,"","",0,"","",0,"[85]"]
[null,"[86]","",null,0,0,0,0,"","",0,"","",0,"","",0,"[86]"]
[null,"[87]","",null,0,0,0,0,"","",0,"","",0,"","",0,"[87]"]
[null,"[88]","",null,0,0,0,0,"","",0,"","",0,"","",0,"[88]"]
[null,"[89]","",null,0,0,0,0,"","",0,"","",0,"","",0,"[89]"]
[null,"[90]","",null,0,0,0,0,"","",0,"","",0,"","",0,"[90]"]
[null,"[91]","",null,0,0,0,0,"",null,0,"",null,0,"",null,0,"[91]"]
[null,"[92]","",null,0,0,0,0,"",null,0,"",null,0,"",null,0,"[92]"]
[null,"[93]","",null,0,0,0,0,"",null,0,"",null,0,"",null,0,"[93]"]
[null,"[94]","",null,0,0,0,0,"",null,0,"",null,0,"",null,0,"[94]"]
[null,"[95]","",null,0,0,0,0,"",null,0,"",null,0,"",null,0,"[95]"]
[null,"[96]","",null,0,0,0,0,"",null,0,"",null,0,"",null,0,"[96]"]
[null,"[97]","",null,0,0,0,0,"",null,0,"",null,0,"",null,0,"[97]"]
[null,"[98]","",null,0,0,0,0,"",null,0,"",null,0,"",null,0,"[98]"]
[null,"[99]","",null,0,0,0,0,"",null,0,"",null,0,"",null,0,"[99]"]
[null,"[100]","",null,0,0,0,0,"",null,0,"",null,0,"",null,0,"[100]"]
[null,"[101]","",null,0,0,0,0,"",null,0,"",null,0,"",null,0,"[101]"]
[null,"[102]","",null,0,0,0,0,"",null,0,"",null,0,"",null,0,"[102]"]
[null,"[103]","",null,0,0,0,0,"",null,0,"",null,0,"",null,0,"[103]"]
[null,"[104]","",null,0,0,0,0,"",null,0,"",null,0,"",null,0,"[104]"]
[null,"[105]","",null,0,0,0,0,"",null,0,"",null,0,"",null,0,"[105]"]
[null,"[106]","",null,0,0,0,0,"",null,0,"",null,0,"",null,0,"[106]"]
[null,"[107]","",null,0,0,0,0,"",null,0,"",null,0,"",null,0,"[107]"]
[null,"[108]","",null,0,0,0,0,"",null,0,"",null,0,"",null,0,"[108]"]
[null,"[109]","",null,0,0,0,0,"",null,0,"",null,0,"",null,0,"[109]"]
[null,"[110]","",null,0,0,0,0,"",null,0,"",null,0,"",null,0,"[110]"]
[null,"[111]","",null,0,0,0,0,"",null,0,"",null,0,"",null,0,"[111]"]
[null,"[112]","",null,0,0,0,0,"",null,0,"",null,0,"",null,0,"[112]"]
[null,"[113]","",null,0,0,0,0,"",null,0,"",null,0,"",null,0,"[113]"]
[null,"[114]","",null,0,0,0,0,"",null,0,"",null,0,"",null,0,"[114]"]
[null,"[115]","",null,0,0,0,0,"",null,0,"",null,0,"",null,0,"[115]"]
[null,"[116]","",null,0,0,0,0,"",null,0,"",null,0,"",null,0,"[116]"]
[null,"[117]","",null,0,0,0,0,"",null,0,"",null,0,"",null,0,"[117]"]
[null,"[118]","",null,0,0,0,0,"",null,0,"",null,0,"",null,0,"[118]"]
[null,"[119]","",null,0,0,0,0,"",null,0,"",null,0,"",null,0,"[119]"]
[null,"[120]","",null,0,0,0,0,"",null,0,"",null,0,"",null,0,"[120]"]
[null,"[121]","",null,0,0,0,0,"",null,0,"",null,0,"",null,0,"[121]"]
[null,"[122]","",null,0,0,0,0,"",null,0,"",null,0,"",null,0,"[122]"]
[null,"[123]","",null,0,0,0,0,"",null,0,"",null,0,"",null,0,"[123]"]
[null,"[124]","",null,0,0,0,0,"",null,0,"",null,0,"",null,0,"[124]"]
[null,"[125]","",null,0,0,0,0,"",null,0,"",null,0,"",null,0,"[125]"]
[null,"[126]","",null,0,0,0,0,"",null,0,"",null,0,"",null,0,"[126]"]
[null,"[127]","",null,0,0,0,0,"",null,0,"",null,0,"",null,0,"[127]"]
[null,"[128]","",null,0,0,0,0,"",null,0,"",null,0,"",null,0,"[128]"]
[null,"[129]","",null,0,0,0,{"$f":"IF(F140=0,0,(E140/F140)*100)","v":0},"",null,0,"",null,0,"",null,0,"[129]"]
[null,"[130]","",null,0,0,0,0,"",null,0,"",null,0,"",null,0,"[130]"]
[null,"[131]","",null,0,0,0,0,"",null,0,"",null,0,"",null,0,"[131]"]
[null,"[132]","",null,0,0,0,0,"",null,0,"",null,0,"",null,0,"[132]"]
[null,"[133]","",null,0,0,0,0,"",null,0,"",null,0,"",null,0,"[133]"]
[null,"[134]","",null,0,0,0,0,"",null,0,"",null,0,"",null,0,"[134]"]
[null,"[135]","",null,0,0,0,0,"",null,0,"",null,0,"",null,0,"[135]"]
[null,"[136]","",null,0,0,0,0,"",null,0,"",null,0,"",null,0,"[136]"]
[null,"[137]","",null,0,0,0,0,"",null,0,"",null,0,"",null,0,"[137]"]
[null,"[138]","",null,0,0,0,0,"",null,0,"",null,0,"",null,0,"[138]"]
[null,"[139]","",null,0,0,0,0,"",null,0,"",null,0,"",null,0,"[139]"]
[null,"[140]","",null,0,0,0,0,"",null,0,"",null,0,"",null,0,"[140]"]
[null,"[141]","",null,0,0,0,0,"",null,0,"",null,0,"",null,0,"[141]"]
[null,"[142]","",null,0,0,0,0,"",null,0,"",null,0,"",null,0,"[142]"]
[null,"[143]","",null,0,0,0,0,"",null,0,"",null,0,"",null,0,"[143]"]
[null,"[144]","",null,0,0,0,0,"",null,0,"",null,0,"",null,0,"[144]"]
[null,"[145]","",null,0,0,0,0,"",null,0,"",null,0,"",null,0,"[145]"]
[null,"[146]","",null,0,0,0,0,"",null,0,"",null,0,"",null,0,"[146]"]
[null,"[147]","",null,0,0,0,0,"",null,0,"",null,0,"",null,0,"[147]"]
[null,"[148]","",null,0,0,0,0,"",null,0,"",null,0,"",null,0,"[148]"]
[null,"[149]","",null,0,0,0,0,"",null,0,"",null,0,"",null,0,"[149]"]
[null,"[150]","",null,0,0,0,0,"",null,0,"",null,0,"",null,0,"[150]"]
[null,"[151]","",null,0,0,0,0,"",null,0,"",null,0,"",null,0,"[151]"]
[null,"[152]","",null,0,0,0,0,"",null,0,"",null,0,"",null,0,"[152]"]
[null,"[153]","",null,0,0,0,0,"",null,0,"",null,0,"",null,0,"[153]"]
[null,"[154]","",null,0,0,0,0,"",null,0,"",null,0,"",null,0,"[154]"]
[null,"[155]","",null,0,0,0,0,"",null,0,"",null,0,"",null,0,"[155]"]
[null,"[156]","",null,0,0,0,0,"",null,0,"",null,0,"",null,0,"[156]"]
[null,"[157]","",null,0,0,0,0,"",null,0,"",null,0,"",null,0,"[157]"]
[null,"[158]","",null,0,0,0,0,"",null,0,"",null,0,"",null,0,"[158]"]
[null,"[159]","",null,0,0,0,0,"",null,0,"",null,0,"",null,0,"[159]"]
[null,"[160]","",null,0,0,0,0,"",null,0,"",null,0,"",null,0,"[160]"]
[null,"[161]","",null,0,0,0,0,"",null,0,"",null,0,"",null,0,"[161]"]
[null,"[162]","",null,0,0,0,0,"",null,0,"",null,0,"",null,0,"[162]"]
[null,"[163]","",null,0,0,0,0,"",null,0,"",null,0,"",null,0,"[163]"]
[null,"[164]","",null,0,0,0,0,"",null,0,"",null,0,"",null,0,"[164]"]
[null,"[165]","",null,0,0,0,0,"",null,0,"",null,0,"",null,0,"[165]"]
[null,"[166]","",null,0,0,0,0,"",null,0,"",null,0,"",null,0,"[166]"]
[null,"[167]","",null,0,0,0,0,"",null,0,"",null,0,"",null,0,"[167]"]
[null,"[168]","",null,0,0,0,0,"",null,0,"",null,0,"",null,0,"[168]"]
[null,"[169]","",null,0,0,0,0,"",null,0,"",null,0,"",null,0,"[169]"]
[null,"[170]","",null,0,0,0,0,"",null,0,"",null,0,"",null,0,"[170]"]
[null,"[171]","",null,0,0,0,0,"",null,0,"",null,0,"",null,0,"[171]"]
[null,"[172]","",null,0,0,0,0,"",null,0,"",null,0,"",null,0,"[172]"]
[null,"[173]","",null,0,0,0,0,"",null,0,"",null,0,"",null,0,"[173]"]
[null,"[174]","",null,0,0,0,0,"",null,0,"",null,0,"",null,0,"[174]"]
[null,"[175]","",null,0,0,0,0,"",null,0,"",null,0,"",null,0,"[175]"]
[null,"[176]","",null,0,0,0,0,"",null,0,"",null,0,"",null,0,"[176]"]
[null,"[177]","",null,0,0,0,0,"",null,0,"",null,0,"",null,0,"[177]"]
[null,"[178]","",null,0,0,0,0,"",null,0,"",null,0,"",null,0,"[178]"]
[null,"[179]","",null,0,0,0,0,"",null,0,"",null,0,"",null,0,"[179]"]
[null,"[180]","",null,0,0,0,0,"",null,0,"",null,0,"",null,0,"[180]"]
[null,"[181]","",null,0,0,0,0,"",null,0,"",null,0,"",null,0,"[181]"]
[null,"[182]","",null,0,0,0,0,"",null,0,"",null,0,"",null,0,"[182]"]
[null,"[183]","",null,0,0,0,0,"",null,0,"",null,0,"",null,0,"[183]"]
[null,"[184]","",null,0,0,0,0,"",null,0,"",null,0,"",null,0,"[184]"]
[null,"[185]","",null,0,0,0,0,"",null,0,"",null,0,"",null,0,"[185]"]
[null,"[186]","",null,0,0,0,0,"",null,0,"",null,0,"",null,0,"[186]"]
[null,"[187]","",null,0,0,0,0,"",null,0,"",null,0,"",null,0,"[187]"]
[null,"[188]","",null,0,0,0,0,"",null,0,"",null,0,"",null,0,"[188]"]
[null,"[189]","",null,0,0,0,0,"",null,0,"",null,0,"",null,0,"[189]"]
[null,"[190]","",null,0,0,0,0,"",null,0,"",null,0,"",null,0,"[190]"]
[null,"[191]","",null,0,0,0,0,"",null,0,"",null,0,"",null,0,"[191]"]
[null,"[192]","",null,0,0,0,0,"",null,0,"",null,0,"",null,0,"[192]"]
[null,"[193]","",null,0,0,0,{"$f":"IF(F204=0,0,(E204/F204)*100)","v":0},"",null,0,"",null,0,"",null,0,"[193]"]
[null,"[194]","",null,0,0,0,0,"",null,0,"",null,0,"",null,0,"[194]"]
[null,"[195]","",null,0,0,0,0,"",null,0,"",null,0,"",null,0,"[195]"]
[null,"[196]","",null,0,0,0,0,"",null,0,"",null,0,"",null,0,"[196]"]
[null,"[197]","",null,0,0,0,0,"",null,0,"",null,0,"",null,0,"[197]"]
[null,"[198]","",null,0,0,0,0,"",null,0,"",null,0,"",null,0,"[198]"]
[null,"[199]","",null,0,0,0,0,"",null,0,"",null,0,"",null,0,"[199]"]
[null,"[200]","",null,0,0,0,0,"",null,0,"",null,0,"",null,0,"[200]"]
[null,"[201]","",null,0,0,0,0,"",null,0,"",null,0,"",null,0,"[201]"]
[null,"[202]","",null,0,0,0,0,"",null,0,"",null,0,"",null,0,"[202]"]
[null,"[203]","",null,0,0,0,0,"",null,0,"",null,0,"",null,0,"[203]"]
[null,"[204]","",null,0,0,0,0,"",null,0,"",null,0,"",null,0,"[204]"]
[null,"[205]","",null,0,0,0,0,"",null,0,"",null,0,"",null,0,"[205]"]
[null,"[206]","",null,0,0,0,0,"",null,0,"",null,0,"",null,0,"[206]"]
[null,"[207]","",null,0,0,0,0,"",null,0,"",null,0,"",null,0,"[207]"]
[null,"[208]","",null,0,0,0,0,"",null,0,"",null,0,"",null,0,"[208]"]
[null,"[209]","",null,0,0,0,0,"",null,0,"",null,0,"",null,0,"[209]"]
[null,"[210]","",null,0,0,0,0,"",null,0,"",null,0,"",null,0,"[210]"]
[null,"[211]","",null,0,0,0,0,"",null,0,"",null,0,"",null,0,"[211]"]
[null,"[212]","",null,0,0,0,0,"",null,0,"",null,0,"",null,0,"[212]"]
[null,"[213]","",null,0,0,0,0,"",null,0,"",null,0,"",null,0,"[213]"]
[null,"[214]","",null,0,0,0,0,"",null,0,"",null,0,"",null,0,"[214]"]
[null,"[215]","",null,0,0,0,0,"",null,0,"",null,0,"",null,0,"[215]"]
[null,"[216]","",null,0,0,0,0,"",null,0,"",null,0,"",null,0,"[216]"]
[null,"[217]","",null,0,0,0,0,"",null,0,"",null,0,"",null,0,"[217]"]
[null,"[218]","",null,0,0,0,0,"",null,0,"",null,0,"",null,0,"[218]"]
[null,"[219]","",null,0,0,0,0,"",null,0,"",null,0,"",null,0,"[219]"]
[null,"[220]","",null,0,0,0,0,"",null,0,"",null,0,"",null,0,"[220]"]
[null,"[221]","",null,0,0,0,0,"",null,0,"",null,0,"",null,0,"[221]"]
[null,"[222]","",null,0,0,0,0,"",null,0,"",null,0,"",null,0,"[222]"]
[null,"[223]","",null,0,0,0,0,"",null,0,"",null,0,"",null,0,"[223]"]
[null,"[224]","",null,0,0,0,0,"",null,0,"",null,0,"",null,0,"[224]"]
[null,"[225]","",null,0,0,0,0,"",null,0,"",null,0,"",null,0,"[225]"]
[null,"[226]","",null,0,0,0,0,"",null,0,"",null,0,"",null,0,"[226]"]
[null,"[227]","",null,0,0,0,0,"",null,0,"",null,0,"",null,0,"[227]"]
[null,"[228]","",null,0,0,0,0,"",null,0,"",null,0,"",null,0,"[228]"]
[null,"[229]","",null,0,0,0,0,"",null,0,"",null,0,"",null,0,"[229]"]
[null,"[230]","",null,0,0,0,0,"",null,0,"",null,0,"",null,0,"[230]"]
[null,"[231]","",null,0,0,0,0,"",null,0,"",null,0,"",null,0,"[231]"]
[null,"[232]","",null,0,0,0,0,"",null,0,"",null,0,"",null,0,"[232]"]
[null,"[233]","",null,0,0,0,0,"",null,0,"",null,0,"",null,0,"[233]"]
[null,"[234]","",null,0,0,0,0,"",null,0,"",null,0,"",null,0,"[234]"]
[null,"[235]","",null,0,0,0,0,"",null,0,"",null,0,"",null,0,"[235]"]
[null,"[236]","",null,0,0,0,0,"",null,0,"",null,0,"",null,0,"[236]"]
[null,"[237]","",null,0,0,0,0,"",null,0,"",null,0,"",null,0,"[237]"]
[null,"[238]","",null,0,0,0,0,"",null,0,"",null,0,"",null,0,"[238]"]
[null,"[239]","",null,0,0,0,0,"",null,0,"",null,0,"",null,0,"[239]"]
[null,"[240]","",null,0,0,0,0,"",null,0,"",null,0,"",null,0,"[240]"]
[null,"[241]","",null,0,0,0,0,"",null,0,"",null,0,"",null,0,"[241]"]
[null,"[242]","",null,0,0,0,0,"",null,0,"",null,0,"",null,0,"[242]"]
[null,"[243]","",null,0,0,0,0,"",null,0,"",null,0,"",null,0,"[243]"]
[null,"[244]","",null,0,0,0,0,"",null,0,"",null,0,"",null,0,"[244]"]
[null,"[245]","",null,0,0,0,0,"",null,0,"",null,0,"",null,0,"[245]"]
[null,"[246]","",null,0,0,0,0,"",null,0,"",null,0,"",null,0,"[246]"]
[null,"[247]","",null,0,0,0,0,"",null,0,"",null,0,"",null,0,"[247]"]
[null,"[248]","",null,0,0,0,0,"",null,0,"",null,0,"",null,0,"[248]"]
[null,"[249]","",null,0,0,0,0,"",null,0,"",null,0,"",null,0,"[249]"]
[null,"[250]","",null,0,0,0,0,"",null,0,"",null,0,"",null,0,"[250]"]
[null,"[251]","",null,0,0,0,0,"",null,0,"",null,0,"",null,0,"[251]"]
[null,"[252]","",null,0,0,0,0,"",null,0,"",null,0,"",null,0,"[252]"]
[null,"[253]","",null,0,0,0,0,"",null,0,"",null,0,"",null,0,"[253]"]
[null,"[254]","",null,0,0,0,0,"",null,0,"",null,0,"",null,0,"[254]"]
[null,"[255]","",null,0,0,0,0,"",null,0,"",null,0,"",null,0,"[255]"]
[null,"[256]","",null,0,0,0,0,"",null,0,"",null,0,"",null,0,"[256]"]
[null,"[257]","",null,0,0,0,{"$f":"IF(F268=0,0,(E268/F268)*100)","v":0},"",null,0,"",null,0,"",null,0,"[257]"]
[null,"[258]","",null,0,0,0,0,"",null,0,"",null,0,"",null,0,"[258]"]
[null,"[259]","",null,0,0,0,0,"",null,0,"",null,0,"",null,0,"[259]"]
[null,"[260]","",null,0,0,0,0,"",null,0,"",null,0,"",null,0,"[260]"]
[null,"[261]","",null,0,0,0,0,"",null,0,"",null,0,"",null,0,"[261]"]
[null,"[262]","",null,0,0,0,0,"",null,0,"",null,0,"",null,0,"[262]"]
[null,"[263]","",null,0,0,0,0,"",null,0,"",null,0,"",null,0,"[263]"]
[null,"[264]","",null,0,0,0,0,"",null,0,"",null,0,"",null,0,"[264]"]
[null,"[265]","",null,0,0,0,0,"",null,0,"",null,0,"",null,0,"[265]"]
[null,"[266]","",null,0,0,0,0,"",null,0,"",null,0,"",null,0,"[266]"]
[null,"[267]","",null,0,0,0,0,"",null,0,"",null,0,"",null,0,"[267]"]
[null,"[268]","",null,0,0,0,0,"",null,0,"",null,0,"",null,0,"[268]"]
[null,"[269]","",null,0,0,0,0,"",null,0,"",null,0,"",null,0,"[269]"]
[null,"[270]","",null,0,0,0,0,"",null,0,"",null,0,"",null,0,"[270]"]
[null,"[271]","",null,0,0,0,0,"",null,0,"",null,0,"",null,0,"[271]"]
[null,"[272]","",null,0,0,0,0,"",null,0,"",null,0,"",null,0,"[272]"]
[null,"[273]","",null,0,0,0,0,"",null,0,"",null,0,"",null,0,"[273]"]
[null,"[274]","",null,0,0,0,0,"",null,0,"",null,0,"",null,0,"[274]"]
[null,"[275]","",null,0,0,0,0,"",null,0,"",null,0,"",null,0,"[275]"]
[null,"[276]","",null,0,0,0,0,"",null,0,"",null,0,"",null,0,"[276]"]
[null,"[277]","",null,0,0,0,0,"",null,0,"",null,0,"",null,0,"[277]"]
[null,"[278]","",null,0,0,0,0,"",null,0,"",null,0,"",null,0,"[278]"]
[null,"[279]","",null,0,0,0,0,"",null,0,"",null,0,"",null,0,"[279]"]
[null,"[280]","",null,0,0,0,0,"",null,0,"",null,0,"",null,0,"[280]"]
[null,"[281]","",null,0,0,0,0,"",null,0,"",null,0,"",null,0,"[281]"]
[null,"[282]","",null,0,0,0,0,"",null,0,"",null,0,"",null,0,"[282]"]
[null,"[283]","",null,0,0,0,0,"",null,0,"",null,0,"",null,0,"[283]"]
[null,"[284]","",null,0,0,0,0,"",null,0,"",null,0,"",null,0,"[284]"]
[null,"[285]","",null,0,0,0,0,"",null,0,"",null,0,"",null,0,"[285]"]
[null,"[286]","",null,0,0,0,0,"",null,0,"",null,0,"",null,0,"[286]"]
[null,"[287]","",null,0,0,0,0,"",null,0,"",null,0,"",null,0,"[287]"]
[null,"[288]","",null,0,0,0,0,"",null,0,"",null,0,"",null,0,"[288]"]
[null,"[289]","",null,0,0,0,0,"",null,0,"",null,0,"",null,0,"[289]"]
[null,"[290]","",null,0,0,0,0,"",null,0,"",null,0,"",null,0,"[290]"]
[null,"[291]","",null,0,0,0,0,"",null,0,"",null,0,"",null,0,"[291]"]
[null,"[292]","",null,0,0,0,0,"",null,0,"",null,0,"",null,0,"[292]"]
[null,"[293]","",null,0,0,0,0,"",null,0,"",null,0,"",null,0,"[293]"]
[null,"[294]","",null,0,0,0,0,"",null,0,"",null,0,"",null,0,"[294]"]
[null,"[295]","",null,0,0,0,0,"",null,0,"",null,0,"",null,0,"[295]"]
[null,"[296]","",null,0,0,0,0,"",null,0,"",null,0,"",null,0,"[296]"]
[null,"[297]","",null,0,0,0,0,"",null,0,"",null,0,"",null,0,"[297]"]
[null,"[298]","",null,0,0,0,0,"",null,0,"",null,0,"",null,0,"[298]"]
[null,"[299]","",null,0,0,0,0,"",null,0,"",null,0,"",null,0,"[299]"]
[null,"[300]","",null,0,0,0,0,"",null,0,"",null,0,"",null,0,"[300]"]
[null,"[301]","",null,0,0,0,0,"",null,0,"",null,0,"",null,0,"[301]"]
[null,"[302]","",null,0,0,0,0,"",null,0,"",null,0,"",null,0,"[302]"]
[null,"[303]","",null,0,0,0,0,"",null,0,"",null,0,"",null,0,"[303]"]
[null,"[304]","",null,0,0,0,0,"",null,0,"",null,0,"",null,0,"[304]"]
[null,"[305]","",null,0,0,0,0,"",null,0,"",null,0,"",null,0,"[305]"]
[null,"[306]","",null,0,0,0,0,"",null,0,"",null,0,"",null,0,"[306]"]
[null,"[307]","",null,0,0,0,0,"",null,0,"",null,0,"",null,0,"[307]"]
[null,"[308]","",null,0,0,0,0,"",null,0,"",null,0,"",null,0,"[308]"]
[null,"[309]","",null,0,0,0,0,"",null,0,"",null,0,"",null,0,"[309]"]
[null,"[310]","",null,0,0,0,0,"",null,0,"",null,0,"",null,0,"[310]"]
[null,"[311]","",null,0,0,0,0,"",null,0,"",null,0,"",null,0,"[311]"]
[null,"[312]","",null,0,0,0,0,"",null,0,"",null,0,"",null,0,"[312]"]
[null,"[313]","",null,0,0,0,0,"",null,0,"",null,0,"",null,0,"[313]"]
[null,"[314]","",null,0,0,0,0,"",null,0,"",null,0,"",null,0,"[314]"]
[null,"[315]","",null,0,0,0,0,"",null,0,"",null,0,"",null,0,"[315]"]
[null,"[316]","",null,0,0,0,0,"",null,0,"",null,0,"",null,0,"[316]"]
[null,"[317]","",null,0,0,0,0,"",null,0,"",null,0,"",null,0,"[317]"]
[null,"[318]","",null,0,0,0,0,"",null,0,"",null,0,"",null,0,"[318]"]
[null,"[319]","",null,0,0,0,0,"",null,0,"",null,0,"",null,0,"[319]"]
[null,"[320]","",null,0,0,0,0,"",null,0,"",null,0,"",null,0,"[320]"]
[null,"[321]","",null,0,0,0,{"$f":"IF(F332=0,0,(E332/F332)*100)","v":0},"",null,0,"",null,0,"",null,0,"[321]"]
[null,"[322]","",null,0,0,0,0,"",null,0,"",null,0,"",null,0,"[322]"]
[null,"[323]","",null,0,0,0,0,"",null,0,"",null,0,"",null,0,"[323]"]
[null,"[324]","",null,0,0,0,0,"",null,0,"",null,0,"",null,0,"[324]"]
[null,"[325]","",null,0,0,0,0,"",null,0,"",null,0,"",null,0,"[325]"]
[null,"[326]","",null,0,0,0,0,"",null,0,"",null,0,"",null,0,"[326]"]
[null,"[327]","",null,0,0,0,0,"",null,0,"",null,0,"",null,0,"[327]"]
[null,"[328]","",null,0,0,0,0,"",null,0,"",null,0,"",null,0,"[328]"]
[null,"[329]","",null,0,0,0,0,"",null,0,"",null,0,"",null,0,"[329]"]
[null,"[330]","",null,0,0,0,0,"",null,0,"",null,0,"",null,0,"[330]"]
[null,"[331]","",null,0,0,0,0,"",null,0,"",null,0,"",null,0,"[331]"]
[null,"[332]","",null,0,0,0,0,"",null,0,"",null,0,"",null,0,"[332]"]
[null,"[333]","",null,0,0,0,0,"",null,0,"",null,0,"",null,0,"[333]"]
[null,"[334]","",null,0,0,0,0,"",null,0,"",null,0,"",null,0,"[334]"]
[null,"[335]","",null,0,0,0,0,"",null,0,"",null,0,"",null,0,"[335]"]
[null,"[336]","",null,0,0,0,0,"",null,0,"",null,0,"",null,0,"[336]"]
[null,"[337]","",null,0,0,0,0,"",null,0,"",null,0,"",null,0,"[337]"]
[null,"[338]","",null,0,0,0,0,"",null,0,"",null,0,"",null,0,"[338]"]
[null,"[339]","",null,0,0,0,0,"",null,0,"",null,0,"",null,0,"[339]"]
[null,"[340]","",null,0,0,0,0,"",null,0,"",null,0,"",null,0,"[340]"]
[null,"[341]","",null,0,0,0,0,"",null,0,"",null,0,"",null,0,"[341]"]
[null,"[342]","",null,0,0,0,0,"",null,0,"",null,0,"",null,0,"[342]"]
[null,"[343]","",null,0,0,0,0,"",null,0,"",null,0,"",null,0,"[343]"]
[null,"[344]","",null,0,0,0,0,"",null,0,"",null,0,"",null,0,"[344]"]
[null,"[345]","",null,0,0,0,0,"",null,0,"",null,0,"",null,0,"[345]"]
[null,"[346]","",null,0,0,0,0,"",null,0,"",null,0,"",null,0,"[346]"]
[null,"[347]","",null,0,0,0,0,"",null,0,"",null,0,"",null,0,"[347]"]
[null,"[348]","",null,0,0,0,0,"",null,0,"",null,0,"",null,0,"[348]"]
[null,"[349]","",null,0,0,0,0,"",null,0,"",null,0,"",null,0,"[349]"]
[null,"[350]","",null,0,0,0,0,"",null,0,"",null,0,"",null,0,"[350]"]
[null,"[351]","",null,0,0,0,0,"",null,0,"",null,0,"",null,0,"[351]"]
[null,"[352]","",null,0,0,0,0,"",null,0,"",null,0,"",null,0,"[352]"]
[null,"[353]","",null,0,0,0,0,"",null,0,"",null,0,"",null,0,"[353]"]
[null,"[354]","",null,0,0,0,0,"",null,0,"",null,0,"",null,0,"[354]"]
[null,"[355]","",null,0,0,0,0,"",null,0,"",null,0,"",null,0,"[355]"]
[null,"[356]","",null,0,0,0,0,"",null,0,"",null,0,"",null,0,"[356]"]
[null,"[357]","",null,0,0,0,0,"",null,0,"",null,0,"",null,0,"[357]"]
[null,"[358]","",null,0,0,0,0,"",null,0,"",null,0,"",null,0,"[358]"]
[null,"[359]","",null,0,0,0,0,"",null,0,"",null,0,"",null,0,"[359]"]
[null,"[360]","",null,0,0,0,0,"",null,0,"",null,0,"",null,0,"[360]"]
[null,"[361]","",null,0,0,0,0,"",null,0,"",null,0,"",null,0,"[361]"]
[null,"[362]","",null,0,0,0,0,"",null,0,"",null,0,"",null,0,"[362]"]
[null,"[363]","",null,0,0,0,0,"",null,0,"",null,0,"",null,0,"[363]"]
[null,"[364]","",null,0,0,0,0,"",null,0,"",null,0,"",null,0,"[364]"]
[null,"[365]","",null,0,0,0,0,"",null,0,"",null,0,"",null,0,"[365]"]
[null,"[366]","",null,0,0,0,0,"",null,0,"",null,0,"",null,0,"[366]"]
[null,"[367]","",null,0,0,0,0,"",null,0,"",null,0,"",null,0,"[367]"]
[null,"[368]","",null,0,0,0,0,"",null,0,"",null,0,"",null,0,"[368]"]
[null,"[369]","",null,0,0,0,0,"",null,0,"",null,0,"",null,0,"[369]"]
[null,"[370]","",null,0,0,0,0,"",null,0,"",null,0,"",null,0,"[370]"]
[null,"[371]","",null,0,0,0,0,"",null,0,"",null,0,"",null,0,"[371]"]
[null,"[372]","",null,0,0,0,0,"",null,0,"",null,0,"",null,0,"[372]"]
[null,"[373]","",null,0,0,0,0,"",null,0,"",null,0,"",null,0,"[373]"]
[null,"[374]","",null,0,0,0,0,"",null,0,"",null,0,"",null,0,"[374]"]
[null,"[375]","",null,0,0,0,0,"",null,0,"",null,0,"",null,0,"[375]"]
[null,"[376]","",null,0,0,0,0,"",null,0,"",null,0,"",null,0,"[376]"]
[null,"[377]","",null,0,0,0,0,"",null,0,"",null,0,"",null,0,"[377]"]
[null,"[378]","",null,0,0,0,0,"",null,0,"",null,0,"",null,0,"[378]"]
[null,"[379]","",null,0,0,0,0,"",null,0,"",null,0,"",null,0,"[379]"]
[null,"[380]","",null,0,0,0,0,"",null,0,"",null,0,"",null,0,"[380]"]
[null,"[381]","",null,0,0,0,0,"",null,0,"",null,0,"",null,0,"[381]"]
[null,"[382]","",null,0,0,0,0,"",null,0,"",null,0,"",null,0,"[382]"]
[null,"[383]","",null,0,0,0,0,"",null,0,"",null,0,"",null,0,"[383]"]
[null,"[384]","",null,0,0,0,0,"",null,0,"",null,0,"",null,0,"[384]"]
[null,"[385]","",null,0,0,0,{"$f":"IF(F396=0,0,(E396/F396)*100)","v":0},"",null,0,"",null,0,"",null,0,"[385]"]
[null,"[386]","",null,0,0,0,0,"",null,0,"",null,0,"",null,0,"[386]"]
[null,"[387]","",null,0,0,0,0,"",null,0,"",null,0,"",null,0,"[387]"]
[null,"[388]","",null,0,0,0,0,"",null,0,"",null,0,"",null,0,"[388]"]
[null,"[389]","",null,0,0,0,0,"",null,0,"",null,0,"",null,0,"[389]"]
[null,"[390]","",null,0,0,0,0,"",null,0,"",null,0,"",null,0,"[390]"]
[null,"[391]","",null,0,0,0,0,"",null,0,"",null,0,"",null,0,"[391]"]
[null,"[392]","",null,0,0,0,0,"",null,0,"",null,0,"",null,0,"[392]"]
[null,"[393]","",null,0,0,0,0,"",null,0,"",null,0,"",null,0,"[393]"]
[null,"[394]","",null,0,0,0,0,"",null,0,"",null,0,"",null,0,"[394]"]
[null,"[395]","",null,0,0,0,0,"",null,0,"",null,0,"",null,0,"[395]"]
[null,"[396]","",null,0,0,0,0,"",null,0,"",null,0,"",null,0,"[396]"]
[null,"[397]","",null,0,0,0,0,"",null,0,"",null,0,"",null,0,"[397]"]
[null,"[398]","",null,0,0,0,0,"",null,0,"",null,0,"",null,0,"[398]"]
[null,"[399]","",null,0,0,0,0,"",null,0,"",null,0,"",null,0,"[399]"]
[null,"[400]","",null,0,0,0,0,"",null,0,"",null,0,"",null,0,"[400]"]
[null,"[401]","",null,0,0,0,0,"",null,0,"",null,0,"",null,0,"[401]"]
[null,"[402]","",null,0,0,0,0,"",null,0,"",null,0,"",null,0,"[402]"]
[null,"[403]","",null,0,0,0,0,"",null,0,"",null,0,"",null,0,"[403]"]
[null,"[404]","",null,0,0,0,0,"",null,0,"",null,0,"",null,0,"[404]"]
[null,"[405]","",null,0,0,0,0,"",null,0,"",null,0,"",null,0,"[405]"]
[null,"[406]","",null,0,0,0,0,"",null,0,"",null,0,"",null,0,"[406]"]
[null,"[407]","",null,0,0,0,0,"",null,0,"",null,0,"",null,0,"[407]"]
[null,"[408]","",null,0,0,0,0,"",null,0,"",null,0,"",null,0,"[408]"]
[null,"[409]","",null,0,0,0,0,"",null,0,"",null,0,"",null,0,"[409]"]
[null,"[410]","",null,0,0,0,0,"",null,0,"",null,0,"",null,0,"[410]"]
[null,"[411]","",null,0,0,0,0,"",null,0,"",null,0,"",null,0,"[411]"]
[null,"[412]","",null,0,0,0,0,"",null,0,"",null,0,"",null,0,"[412]"]
[null,"[413]","",null,0,0,0,0,"",null,0,"",null,0,"",null,0,"[413]"]
[null,"[414]","",null,0,0,0,0,"",null,0,"",null,0,"",null,0,"[414]"]
[null,"[415]","",null,0,0,0,0,"",null,0,"",null,0,"",null,0,"[415]"]
[null,"[416]","",null,0,0,0,0,"",null,0,"",null,0,"",null,0,"[416]"]
[null,"[417]","",null,0,0,0,0,"",null,0,"",null,0,"",null,0,"[417]"]
[null,"[418]","",null,0,0,0,0,"",null,0,"",null,0,"",null,0,"[418]"]
[null,"[419]","",null,0,0,0,0,"",null,0,"",null,0,"",null,0,"[419]"]
[null,"[420]","",null,0,0,0,0,"",null,0,"",null,0,"",null,0,"[420]"]
[null,"[421]","",null,0,0,0,0,"",null,0,"",null,0,"",null,0,"[421]"]
[null,"[422]","",null,0,0,0,0,"",null,0,"",null,0,"",null,0,"[422]"]
[null,"[423]","",null,0,0,0,0,"",null,0,"",null,0,"",null,0,"[423]"]
[null,"[424]","",null,0,0,0,0,"",null,0,"",null,0,"",null,0,"[424]"]
[null,"[425]","",null,0,0,0,0,"",null,0,"",null,0,"",null,0,"[425]"]
[null,"[426]","",null,0,0,0,0,"",null,0,"",null,0,"",null,0,"[426]"]
[null,"[427]","",null,0,0,0,0,"",null,0,"",null,0,"",null,0,"[427]"]
[null,"[428]","",null,0,0,0,0,"",null,0,"",null,0,"",null,0,"[428]"]
[null,"[429]","",null,0,0,0,0,"",null,0,"",null,0,"",null,0,"[429]"]
[null,"[430]","",null,0,0,0,0,"",null,0,"",null,0,"",null,0,"[430]"]
[null,"[431]","",null,0,0,0,0,"",null,0,"",null,0,"",null,0,"[431]"]
[null,"[432]","",null,0,0,0,0,"",null,0,"",null,0,"",null,0,"[432]"]
[null,"[433]","",null,0,0,0,0,"",null,0,"",null,0,"",null,0,"[433]"]
[null,"[434]","",null,0,0,0,0,"",null,0,"",null,0,"",null,0,"[434]"]
[null,"[435]","",null,0,0,0,0,"",null,0,"",null,0,"",null,0,"[435]"]
[null,"[436]","",null,0,0,0,0,"",null,0,"",null,0,"",null,0,"[436]"]
[null,"[437]","",null,0,0,0,0,"",null,0,"",null,0,"",null,0,"[437]"]
[null,"[438]","",null,0,0,0,0,"",null,0,"",null,0,"",null,0,"[438]"]
[null,"[439]","",null,0,0,0,0,"",null,0,"",null,0,"",null,0,"[439]"]
[null,"[440]","",null,0,0,0,0,"",null,0,"",null,0,"",null,0,"[440]"]
[null,"[441]","",null,0,0,0,0,"",null,0,"",null,0,"",null,0,"[441]"]
[null,"[442]","",null,0,0,0,0,"",null,0,"",null,0,"",null,0,"[442]"]
[null,"[443]","",null,0,0,0,0,"",null,0,"",null,0,"",null,0,"[443]"]
[null,"[444]","",null,0,0,0,0,"",null,0,"",null,0,"",null,0,"[444]"]
[null,"[445]","",null,0,0,0,0,"",null,0,"",null,0,"",null,0,"[445]"]
[null,"[446]","",null,0,0,0,0,"",null,0,"",null,0,"",null,0,"[446]"]
[null,"[447]","",null,0,0,0,0,"",null,0,"",null,0,"",null,0,"[447]"]
[null,"[448]","",null,0,0,0,0,"",null,0,"",null,0,"",null,0,"[448]"]
[null,"[449]","",null,0,0,0,{"$f":"IF(F460=0,0,(E460/F460)*100)","v":0},"",null,0,"",null,0,"",null,0,"[449]"]
[null,"[450]","",null,0,0,0,0,"",null,0,"",null,0,"",null,0,"[450]"]
[null,"[451]","",null,0,0,0,0,"",null,0,"",null,0,"",null,0,"[451]"]
[null,"[452]","",null,0,0,0,0,"",null,0,"",null,0,"",null,0,"[452]"]
[null,"[453]","",null,0,0,0,0,"",null,0,"",null,0,"",null,0,"[453]"]
[null,"[454]","",null,0,0,0,0,"",null,0,"",null,0,"",null,0,"[454]"]
[null,"[455]","",null,0,0,0,0,"",null,0,"",null,0,"",null,0,"[455]"]
[null,"[456]","",null,0,0,0,0,"",null,0,"",null,0,"",null,0,"[456]"]
[null,"[457]","",null,0,0,0,0,"",null,0,"",null,0,"",null,0,"[457]"]
[null,"[458]","",null,0,0,0,0,"",null,0,"",null,0,"",null,0,"[458]"]
[null,"[459]","",null,0,0,0,0,"",null,0,"",null,0,"",null,0,"[459]"]
[null,"[460]","",null,0,0,0,0,"",null,0,"",null,0,"",null,0,"[460]"]
[null,"[461]","",null,0,0,0,0,"",null,0,"",null,0,"",null,0,"[461]"]
[null,"[462]","",null,0,0,0,0,"",null,0,"",null,0,"",null,0,"[462]"]
[null,"[463]","",null,0,0,0,0,"",null,0,"",null,0,"",null,0,"[463]"]
[null,"[464]","",null,0,0,0,0,"",null,0,"",null,0,"",null,0,"[464]"]
[null,"[465]","",null,0,0,0,0,"",null,0,"",null,0,"",null,0,"[465]"]
[null,"[466]","",null,0,0,0,0,"",null,0,"",null,0,"",null,0,"[466]"]
[null,"[467]","",null,0,0,0,0,"",null,0,"",null,0,"",null,0,"[467]"]
[null,"[468]","",null,0,0,0,0,"",null,0,"",null,0,"",null,0,"[468]"]
[null,"[469]","",null,0,0,0,0,"",null,0,"",null,0,"",null,0,"[469]"]
[null,"[470]","",null,0,0,0,0,"",null,0,"",null,0,"",null,0,"[470]"]
[null,"[471]","",null,0,0,0,0,"",null,0,"",null,0,"",null,0,"[471]"]
[null,"[472]","",null,0,0,0,0,"",null,0,"",null,0,"",null,0,"[472]"]
[null,"[473]","",null,0,0,0,0,"",null,0,"",null,0,"",null,0,"[473]"]
[null,"[474]","",null,0,0,0,0,"",null,0,"",null,0,"",null,0,"[474]"]
[null,"[475]","",null,0,0,0,0,"",null,0,"",null,0,"",null,0,"[475]"]
[null,"[476]","",null,0,0,0,0,"",null,0,"",null,0,"",null,0,"[476]"]
[null,"[477]","",null,0,0,0,0,"",null,0,"",null,0,"",null,0,"[477]"]
[null,"[478]","",null,0,0,0,0,"",null,0,"",null,0,"",null,0,"[478]"]
[null,"[479]","",null,0,0,0,0,"",null,0,"",null,0,"",null,0,"[479]"]
[null,"[480]","",null,0,0,0,0,"",null,0,"",null,0,"",null,0,"[480]"]
[null,"[481]","",null,0,0,0,0,"",null,0,"",null,0,"",null,0,"[481]"]
[null,"[482]","",null,0,0,0,0,"",null,0,"",null,0,"",null,0,"[482]"]
[null,"[483]","",null,0,0,0,0,"",null,0,"",null,0,"",null,0,"[483]"]
[null,"[484]","",null,0,0,0,0,"",null,0,"",null,0,"",null,0,"[484]"]
[null,"[485]","",null,0,0,0,0,"",null,0,"",null,0,"",null,0,"[485]"]
[null,"[486]","",null,0,0,0,0,"",null,0,"",null,0,"",null,0,"[486]"]
[null,"[487]","",null,0,0,0,0,"",null,0,"",null,0,"",null,0,"[487]"]
[null,"[488]","",null,0,0,0,0,"",null,0,"",null,0,"",null,0,"[488]"]
[null,"[489]","",null,0,0,0,0,"",null,0,"",null,0,"",null,0,"[489]"]
[null,"[490]","",null,0,0,0,0,"",null,0,"",null,0,"",null,0,"[490]"]
[null,"[491]","",null,0,0,0,0,"",null,0,"",null,0,"",null,0,"[491]"]
[null,"[492]","",null,0,0,0,0,"",null,0,"",null,0,"",null,0,"[492]"]
[null,"[493]","",null,0,0,0,0,"",null,0,"",null,0,"",null,0,"[493]"]
[null,"[494]","",null,0,0,0,0,"",null,0,"",null,0,"",null,0,"[494]"]
[null,"[495]","",null,0,0,0,0,"",null,0,"",null,0,"",null,0,"[495]"]
[null,"[496]","",null,0,0,0,0,"",null,0,"",null,0,"",null,0,"[496]"]
[null,"[497]","",null,0,0,0,0,"","",0,"","",0,"","",0,"[497]"]
[null,"[498]","",null,0,0,0,0,"","",0,"","",0,"","",0,"[498]"]
[null,"[499]","",null,0,0,0,0,"","",0,"","",0,"","",0,"[499]"]
[null,"[500]","",null,0,0,0,0,"","",0,"","",0,"","",0,"[500]"]
[null,"[501]","",null,0,0,0,0,"","",0,"","",0,"","",0,"[501]"]
[null,"[502]","",null,0,0,0,0,"","",0,"","",0,"","",0,"[502]"]
[null,"[503]","",null,0,0,0,0,"","",0,"","",0,"","",0,"[503]"]
[null,"[504]","",null,0,0,0,0,"","",0,"","",0,"","",0,"[504]"]
[null,"[505]","",null,0,0,0,0,"","",0,"","",0,"","",0,"[505]"]
[null,"[506]","",null,0,0,0,0,"","",0,"","",0,"","",0,"[506]"]
[null,"[507]","",null,0,0,0,0,"","",0,"","",0,"","",0,"[507]"]
[null,"[508]","",null,0,0,0,0,"","",0,"","",0,"","",0,"[508]"]
[null,"[509]","",null,0,0,0,0,"","",0,"","",0,"","",0,"[509]"]
[null,"[510]","",null,0,0,0,0,"","",0,"","",0,"","",0,"[510]"]
[null,"[511]","",null,0,0,0,0,"","",0,"","",0,"","",0,"[511]"]
[null,"[512]","",null,0,0,0,0,"","",0,"","",0,"","",0,"[512]"]
[null,"[513]","",null,0,0,0,{"$f":"IF(F524=0,0,(E524/F524)*100)","v":0},"","",0,"","",0,"","",0,"[513]"]
[null,"[514]","",null,0,0,0,0,"","",0,"","",0,"","",0,"[514]"]
[null,"[515]","",null,0,0,0,0,"","",0,"","",0,"","",0,"[515]"]
[null,"[516]","",null,0,0,0,0,"","",0,"","",0,"","",0,"[516]"]
[null,"[517]","",null,0,0,0,0,"","",0,"","",0,"","",0,"[517]"]
[null,"[518]","",null,0,0,0,0,"","",0,"","",0,"","",0,"[518]"]
[null,"[519]","",null,0,0,0,0,"","",0,"","",0,"","",0,"[519]"]
[null,"[520]","",null,0,0,0,0,"",null,0,"",null,0,"",null,0,"[520]"]
[null,"[521]","",null,0,0,0,0,"","",0,"","",0,"","",0,"[521]"]
[null,"[522]","",null,0,0,0,0,"","",0,"","",0,"","",0,"[522]"]
[null,"[523]","",null,0,0,0,0,"","",0,"","",0,"","",0,"[523]"]
[null,"[524]","",null,0,0,0,0,"","",0,"","",0,"","",0,"[524]"]
[null,"[525]","",null,0,0,0,0,"","",0,"","",0,"","",0,"[525]"]
[null,"[526]","",null,0,0,0,0,"","",0,"","",0,"","",0,"[526]"]
[null,"[527]","",null,0,0,0,0,"","",0,"","",0,"","",0,"[527]"]
[null,"[528]","",null,0,0,0,0,"","",0,"","",0,"","",0,"[528]"]
[null,"[529]","",null,0,0,0,{"$f":"IF(F540=0,0,(E540/F540)*100)","v":0},"","",0,"","",0,"","",0,"[529]"]
[null,"[530]","",null,0,0,0,{"$f":"IF(F541=0,0,(E541/F541)*100)","v":0},"","",0,"","",0,"","",0,"[530]"]
[null,"[531]","",null,0,0,0,{"$f":"IF(F542=0,0,(E542/F542)*100)","v":0},"","",0,"","",0,"","",0,"[531]"]
[null,"[532]","",null,0,0,0,0,"","",0,"","",0,"","",0,"[532]"]
[null,"[533]","",null,0,0,0,0,"","",0,"","",0,"","",0,"[533]"]
[null,"[534]","",null,0,0,0,0,"","",0,"","",0,"","",0,"[534]"]
[null,"[535]","",null,0,0,0,0,"","",0,"","",0,"","",0,"[535]"]
[null,"[536]","",null,0,0,0,0,"","",0,"","",0,"","",0,"[536]"]
[null,"[537]","",null,0,0,0,0,"","",0,"","",0,"","",0,"[537]"]
[null,"[538]","",null,0,0,0,0,"","",0,"","",0,"","",0,"[538]"]
[null,"[539]","",null,0,0,0,0,"","",0,"","",0,"","",0,"[539]"]
[null,"[540]","",null,0,0,0,0,"","",0,"","",0,"","",0,"[540]"]
[null,"[541]","",null,0,0,0,0,"",null,0,"",null,0,"",null,0,"[541]"]
[null,"[542]","",null,0,0,0,0,"",null,0,"",null,0,"",null,0,"[542]"]
[null,"[543]","",null,0,0,0,0,"",null,0,"",null,0,"",null,0,"[543]"]
[null,"[544]","",null,0,0,0,0,"",null,0,"",null,0,"",null,0,"[544]"]
[null,"[545]","",null,0,0,0,0,"",null,0,"",null,0,"",null,0,"[545]"]
[null,"[546]","",null,0,0,0,0,"",null,0,"",null,0,"",null,0,"[546]"]
[null,"[547]","",null,0,0,0,0,"",null,0,"",null,0,"",null,0,"[547]"]
[null,"[548]","",null,0,0,0,0,"",null,0,"",null,0,"",null,0,"[548]"]
[null,"[549]","",null,0,0,0,0,"",null,0,"",null,0,"",null,0,"[549]"]
[null,"[550]","",null,0,0,0,0,"",null,0,"",null,0,"",null,0,"[550]"]
[null,"[551]","",null,0,0,0,0,"",null,0,"",null,0,"",null,0,"[551]"]
[null,"[552]","",null,0,0,0,0,"",null,0,"",null,0,"",null,0,"[552]"]
[null,"[553]","",null,0,0,0,0,"",null,0,"",null,0,"",null,0,"[553]"]
[null,"[554]","",null,0,0,0,0,"",null,0,"",null,0,"",null,0,"[554]"]
[null,"[555]","",null,0,0,0,0,"",null,0,"",null,0,"",null,0,"[555]"]
[null,"[556]","",null,0,0,0,0,"",null,0,"",null,0,"",null,0,"[556]"]
[null,"[557]","",null,0,0,0,0,"",null,0,"",null,0,"",null,0,"[557]"]
[null,"[558]","",null,0,0,0,0,"",null,0,"",null,0,"",null,0,"[558]"]
[null,"[559]","",null,0,0,0,0,"",null,0,"",null,0,"",null,0,"[559]"]
[null,"[560]","",null,0,0,0,0,"",null,0,"",null,0,"",null,0,"[560]"]
[null,"[561]","",null,0,0,0,0,"",null,0,"",null,0,"",null,0,"[561]"]
[null,"[562]","",null,0,0,0,0,"",null,0,"",null,0,"",null,0,"[562]"]
[null,"[563]","",null,0,0,0,0,"",null,0,"",null,0,"",null,0,"[563]"]
[null,"[564]","",null,0,0,0,0,"",null,0,"",null,0,"",null,0,"[564]"]
[null,"[565]","",null,0,0,0,0,"",null,0,"",null,0,"",null,0,"[565]"]
[null,"[566]","",null,0,0,0,0,"",null,0,"",null,0,"",null,0,"[566]"]
[null,"[567]","",null,0,0,0,0,"",null,0,"",null,0,"",null,0,"[567]"]
[null,"[568]","",null,0,0,0,0,"",null,0,"",null,0,"",null,0,"[568]"]
[null,"[569]","",null,0,0,0,0,"",null,0,"",null,0,"",null,0,"[569]"]
[null,"[570]","",null,0,0,0,0,"",null,0,"",null,0,"",null,0,"[570]"]
[null,"[571]","",null,0,0,0,0,"",null,0,"",null,0,"",null,0,"[571]"]
[null,"[572]","",null,0,0,0,0,"",null,0,"",null,0,"",null,0,"[572]"]
[null,"[573]","",null,0,0,0,0,"",null,0,"",null,0,"",null,0,"[573]"]
[null,"[574]","",null,0,0,0,0,"",null,0,"",null,0,"",null,0,"[574]"]
[null,"[575]","",null,0,0,0,0,"",null,0,"",null,0,"",null,0,"[575]"]
[null,"[576]","",null,0,0,0,0,"",null,0,"",null,0,"",null,0,"[576]"]
[null,"[577]","",null,0,0,0,0,"",null,0,"",null,0,"",null,0,"[577]"]
[null,"[578]","",null,0,0,0,0,"",null,0,"",null,0,"",null,0,"[578]"]
[null,"[579]","",null,0,0,0,0,"",null,0,"",null,0,"",null,0,"[579]"]
[null,"[580]","",null,0,0,0,0,"",null,0,"",null,0,"",null,0,"[580]"]
[null,"[581]","",null,0,0,0,0,"",null,0,"",null,0,"",null,0,"[581]"]
[null,"[582]","",null,0,0,0,0,"",null,0,"",null,0,"",null,0,"[582]"]
[null,"[583]","",null,0,0,0,0,"",null,0,"",null,0,"",null,0,"[583]"]
[null,"[584]","",null,0,0,0,0,"",null,0,"",null,0,"",null,0,"[584]"]
[null,"[585]","",null,0,0,0,0,"",null,0,"",null,0,"",null,0,"[585]"]
[null,"[586]","",null,0,0,0,0,"",null,0,"",null,0,"",null,0,"[586]"]
[null,"[587]","",null,0,0,0,0,"",null,0,"",null,0,"",null,0,"[587]"]
[null,"[588]","",null,0,0,0,0,"",null,0,"",null,0,"",null,0,"[588]"]
[null,"[589]","",null,0,0,0,0,"",null,0,"",null,0,"",null,0,"[589]"]
[null,"[590]","",null,0,0,0,0,"",null,0,"",null,0,"",null,0,"[590]"]
[null,"[591]","",null,0,0,0,0,"",null,0,"",null,0,"",null,0,"[591]"]
[null,"[592]","",null,0,0,0,0,"",null,0,"",null,0,"",null,0,"[592]"]
[null,"[593]","",null,0,0,0,0,"",null,0,"",null,0,"",null,0,"[593]"]
[null,"[594]","",null,0,0,0,0,"",null,0,"",null,0,"",null,0,"[594]"]
[null,"[595]","",null,0,0,0,{"$f":"IF(F606=0,0,(E606/F606)*100)","v":0},"",null,0,"",null,0,"",null,0,"[595]"]
[null,"[596]","",null,0,0,0,0,"",null,0,"",null,0,"",null,0,"[596]"]
[null,"[597]","",null,0,0,0,0,"",null,0,"",null,0,"",null,0,"[597]"]
[null,"[598]","",null,0,0,0,0,"",null,0,"",null,0,"",null,0,"[598]"]
[null,"[599]","",null,0,0,0,0,"",null,0,"",null,0,"",null,0,"[599]"]
[null,"[600]","",null,0,0,0,0,"",null,0,"",null,0,"",null,0,"[600]"]
[null,"[601]","",null,0,0,0,0,"",null,0,"",null,0,"",null,0,"[601]"]
[null,"[602]","",null,0,0,0,0,"",null,0,"",null,0,"",null,0,"[602]"]
[null,"[603]","",null,0,0,0,0,"",null,0,"",null,0,"",null,0,"[603]"]
[null,"[604]","",null,0,0,0,0,"",null,0,"",null,0,"",null,0,"[604]"]
[null,"[605]","",null,0,0,0,0,"",null,0,"",null,0,"",null,0,"[605]"]
[null,"[606]","",null,0,0,0,0,"",null,0,"",null,0,"",null,0,"[606]"]
[null,"[607]","",null,0,0,0,0,"",null,0,"",null,0,"",null,0,"[607]"]
[null,"[608]","",null,0,0,0,0,"",null,0,"",null,0,"",null,0,"[608]"]
[null,"[609]","",null,0,0,0,0,"",null,0,"",null,0,"",null,0,"[609]"]
[null,"[610]","",null,0,0,0,0,"",null,0,"",null,0,"",null,0,"[610]"]
[null,"[611]","",null,0,0,0,0,"",null,0,"",null,0,"",null,0,"[611]"]
[null,"[612]","",null,0,0,0,0,"",null,0,"",null,0,"",null,0,"[612]"]
[null,"[613]","",null,0,0,0,0,"",null,0,"",null,0,"",null,0,"[613]"]
[null,"[614]","",null,0,0,0,0,"",null,0,"",null,0,"",null,0,"[614]"]
[null,"[615]","",null,0,0,0,0,"",null,0,"",null,0,"",null,0,"[615]"]
[null,"[616]","",null,0,0,0,0,"",null,0,"",null,0,"",null,0,"[616]"]
[null,"[617]","",null,0,0,0,0,"",null,0,"",null,0,"",null,0,"[617]"]
[null,"[618]","",null,0,0,0,0,"",null,0,"",null,0,"",null,0,"[618]"]
[null,"[619]","",null,0,0,0,0,"",null,0,"",null,0,"",null,0,"[619]"]
[null,"[620]","",null,0,0,0,0,"",null,0,"",null,0,"",null,0,"[620]"]
[null,"[621]","",null,0,0,0,0,"",null,0,"",null,0,"",null,0,"[621]"]
[null,"[622]","",null,0,0,0,0,"",null,0,"",null,0,"",null,0,"[622]"]
[null,"[623]","",null,0,0,0,0,"",null,0,"",null,0,"",null,0,"[623]"]
[null,"[624]","",null,0,0,0,0,"",null,0,"",null,0,"",null,0,"[624]"]
[null,"[625]","",null,0,0,0,0,"",null,0,"",null,0,"",null,0,"[625]"]
[null,"[626]","",null,0,0,0,0,"",null,0,"",null,0,"",null,0,"[626]"]
[null,"[627]","",null,0,0,0,0,"",null,0,"",null,0,"",null,0,"[627]"]
[null,"[628]","",null,0,0,0,0,"",null,0,"",null,0,"",null,0,"[628]"]
[null,"[629]","",null,0,0,0,0,"",null,0,"",null,0,"",null,0,"[629]"]
[null,"[630]","",null,0,0,0,0,"",null,0,"",null,0,"",null,0,"[630]"]
[null,"[631]","",null,0,0,0,0,"",null,0,"",null,0,"",null,0,"[631]"]
[null,"[632]","",null,0,0,0,0,"",null,0,"",null,0,"",null,0,"[632]"]
[null,"[633]","",null,0,0,0,0,"",null,0,"",null,0,"",null,0,"[633]"]
[null,"[634]","",null,0,0,0,0,"",null,0,"",null,0,"",null,0,"[634]"]
[null,"[635]","",null,0,0,0,0,"",null,0,"",null,0,"",null,0,"[635]"]
[null,"[636]","",null,0,0,0,0,"",null,0,"",null,0,"",null,0,"[636]"]
[null,"[637]","",null,0,0,0,0,"",null,0,"",null,0,"",null,0,"[637]"]
[null,"[638]","",null,0,0,0,0,"",null,0,"",null,0,"",null,0,"[638]"]
[null,"[639]","",null,0,0,0,0,"",null,0,"",null,0,"",null,0,"[639]"]
[null,"[640]","",null,0,0,0,0,"",null,0,"",null,0,"",null,0,"[640]"]
[null,"[641]","",null,0,0,0,0,"",null,0,"",null,0,"",null,0,"[641]"]
[null,"[642]","",null,0,0,0,0,"",null,0,"",null,0,"",null,0,"[642]"]
[null,"[643]","",null,0,0,0,0,"",null,0,"",null,0,"",null,0,"[643]"]
[null,"[644]","",null,0,0,0,0,"",null,0,"",null,0,"",null,0,"[644]"]
[null,"[645]","",null,0,0,0,0,"",null,0,"",null,0,"",null,0,"[645]"]
[null,"[646]","",null,0,0,0,0,"",null,0,"",null,0,"",null,0,"[646]"]
[null,"[647]","",null,0,0,0,0,"",null,0,"",null,0,"",null,0,"[647]"]
[null,"[648]","",null,0,0,0,0,"",null,0,"",null,0,"",null,0,"[648]"]
[null,"[649]","",null,0,0,0,0,"",null,0,"",null,0,"",null,0,"[649]"]
[null,"[650]","",null,0,0,0,0,"",null,0,"",null,0,"",null,0,"[650]"]
[null,"[651]","",null,0,0,0,0,"",null,0,"",null,0,"",null,0,"[651]"]
[null,"[652]","",null,0,0,0,0,"",null,0,"",null,0,"",null,0,"[652]"]
[null,"[653]","",null,0,0,0,0,"",null,0,"",null,0,"",null,0,"[653]"]
[null,"[654]","",null,0,0,0,0,"",null,0,"",null,0,"",null,0,"[654]"]
[null,"[655]","",null,0,0,0,0,"",null,0,"",null,0,"",null,0,"[655]"]
[null,"[656]","",null,0,0,0,0,"",null,0,"",null,0,"",null,0,"[656]"]
[null,"[657]","",null,0,0,0,0,"",null,0,"",null,0,"",null,0,"[657]"]
[null,"[658]","",null,0,0,0,0,"",null,0,"",null,0,"",null,0,"[658]"]
[null,"[659]","",null,0,0,0,{"$f":"IF(F670=0,0,(E670/F670)*100)","v":0},"",null,0,"",null,0,"",null,0,"[659]"]
[null,"[660]","",null,0,0,0,0,"",null,0,"",null,0,"",null,0,"[660]"]
[null,"[661]","",null,0,0,0,0,"",null,0,"",null,0,"",null,0,"[661]"]
[null,"[662]","",null,0,0,0,0,"",null,0,"",null,0,"",null,0,"[662]"]
[null,"[663]","",null,0,0,0,0,"",null,0,"",null,0,"",null,0,"[663]"]
[null,"[664]","",null,0,0,0,0,"",null,0,"",null,0,"",null,0,"[664]"]
[null,"[665]","",null,0,0,0,0,"",null,0,"",null,0,"",null,0,"[665]"]
[null,"[666]","",null,0,0,0,0,"",null,0,"",null,0,"",null,0,"[666]"]
[null,"[667]","",null,0,0,0,0,"",null,0,"",null,0,"",null,0,"[667]"]
[null,"[668]","",null,0,0,0,0,"",null,0,"",null,0,"",null,0,"[668]"]
[null,"[669]","",null,0,0,0,0,"",null,0,"",null,0,"",null,0,"[669]"]
[null,"[670]","",null,0,0,0,0,"",null,0,"",null,0,"",null,0,"[670]"]
[null,"[671]","",null,0,0,0,0,"",null,0,"",null,0,"",null,0,"[671]"]
[null,"[672]","",null,0,0,0,0,"",null,0,"",null,0,"",null,0,"[672]"]
[null,"[673]","",null,0,0,0,0,"",null,0,"",null,0,"",null,0,"[673]"]
[null,"[674]","",null,0,0,0,0,"",null,0,"",null,0,"",null,0,"[674]"]
[null,"[675]","",null,0,0,0,0,"",null,0,"",null,0,"",null,0,"[675]"]
[null,"[676]","",null,0,0,0,0,"",null,0,"",null,0,"",null,0,"[676]"]
[null,"[677]","",null,0,0,0,0,"",null,0,"",null,0,"",null,0,"[677]"]
[null,"[678]","",null,0,0,0,0,"",null,0,"",null,0,"",null,0,"[678]"]
[null,"[679]","",null,0,0,0,0,"",null,0,"",null,0,"",null,0,"[679]"]
[null,"[680]","",null,0,0,0,0,"",null,0,"",null,0,"",null,0,"[680]"]
[null,"[681]","",null,0,0,0,0,"",null,0,"",null,0,"",null,0,"[681]"]
[null,"[682]","",null,0,0,0,0,"",null,0,"",null,0,"",null,0,"[682]"]
[null,"[683]","",null,0,0,0,0,"",null,0,"",null,0,"",null,0,"[683]"]
[null,"[684]","",null,0,0,0,0,"",null,0,"",null,0,"",null,0,"[684]"]
[null,"[685]","",null,0,0,0,0,"",null,0,"",null,0,"",null,0,"[685]"]
[null,"[686]","",null,0,0,0,0,"",null,0,"",null,0,"",null,0,"[686]"]
[null,"[687]","",null,0,0,0,0,"",null,0,"",null,0,"",null,0,"[687]"]
[null,"[688]","",null,0,0,0,0,"",null,0,"",null,0,"",null,0,"[688]"]
[null,"[689]","",null,0,0,0,0,"",null,0,"",null,0,"",null,0,"[689]"]
[null,"[690]","",null,0,0,0,0,"",null,0,"",null,0,"",null,0,"[690]"]
[null,"[691]","",null,0,0,0,0,"",null,0,"",null,0,"",null,0,"[691]"]
[null,"[692]","",null,0,0,0,0,"",null,0,"",null,0,"",null,0,"[692]"]
[null,"[693]","",null,0,0,0,0,"",null,0,"",null,0,"",null,0,"[693]"]
[null,"[694]","",null,0,0,0,0,"",null,0,"",null,0,"",null,0,"[694]"]
[null,"[695]","",null,0,0,0,0,"",null,0,"",null,0,"",null,0,"[695]"]
[null,"[696]","",null,0,0,0,0,"",null,0,"",null,0,"",null,0,"[696]"]
[null,"[697]","",null,0,0,0,0,"",null,0,"",null,0,"",null,0,"[697]"]
[null,"[698]","",null,0,0,0,0,"",null,0,"",null,0,"",null,0,"[698]"]
[null,"[699]","",null,0,0,0,0,"",null,0,"",null,0,"",null,0,"[699]"]
[null,"[700]","",null,0,0,0,0,"",null,0,"",null,0,"",null,0,"[700]"]
[null,"[701]","",null,0,0,0,0,"",null,0,"",null,0,"",null,0,"[701]"]
[null,"[702]","",null,0,0,0,0,"",null,0,"",null,0,"",null,0,"[702]"]
[null,"[703]","",null,0,0,0,0,"",null,0,"",null,0,"",null,0,"[703]"]
[null,"[704]","",null,0,0,0,0,"",null,0,"",null,0,"",null,0,"[704]"]
[null,"[705]","",null,0,0,0,0,"",null,0,"",null,0,"",null,0,"[705]"]
[null,"[706]","",null,0,0,0,0,"",null,0,"",null,0,"",null,0,"[706]"]
[null,"[707]","",null,0,0,0,0,"",null,0,"",null,0,"",null,0,"[707]"]
[null,"[708]","",null,0,0,0,0,"",null,0,"",null,0,"",null,0,"[708]"]
[null,"[709]","",null,0,0,0,0,"",null,0,"",null,0,"",null,0,"[709]"]
[null,"[710]","",null,0,0,0,0,"",null,0,"",null,0,"",null,0,"[710]"]
[null,"[711]","",null,0,0,0,0,"",null,0,"",null,0,"",null,0,"[711]"]
[null,"[712]","",null,0,0,0,0,"",null,0,"",null,0,"",null,0,"[712]"]
[null,"[713]","",null,0,0,0,0,"",null,0,"",null,0,"",null,0,"[713]"]
[null,"[714]","",null,0,0,0,0,"",null,0,"",null,0,"",null,0,"[714]"]
[null,"[715]","",null,0,0,0,0,"",null,0,"",null,0,"",null,0,"[715]"]
[null,"[716]","",null,0,0,0,0,"",null,0,"",null,0,"",null,0,"[716]"]
[null,"[717]","",null,0,0,0,0,"",null,0,"",null,0,"",null,0,"[717]"]
[null,"[718]","",null,0,0,0,0,"",null,0,"",null,0,"",null,0,"[718]"]
[null,"[719]","",null,0,0,0,0,"",null,0,"",null,0,"",null,0,"[719]"]
[null,"[720]","",null,0,0,0,0,"",null,0,"",null,0,"",null,0,"[720]"]
[null,"[721]","",null,0,0,0,0,"",null,0,"",null,0,"",null,0,"[721]"]
[null,"[722]","",null,0,0,0,0,"",null,0,"",null,0,"",null,0,"[722]"]
[null,"[723]","",null,0,0,0,{"$f":"IF(F734=0,0,(E734/F734)*100)","v":0},"",null,0,"",null,0,"",null,0,"[723]"]
[null,"[724]","",null,0,0,0,0,"",null,0,"",null,0,"",null,0,"[724]"]
[null,"[725]","",null,0,0,0,0,"",null,0,"",null,0,"",null,0,"[725]"]
[null,"[726]","",null,0,0,0,0,"",null,0,"",null,0,"",null,0,"[726]"]
[null,"[727]","",null,0,0,0,0,"",null,0,"",null,0,"",null,0,"[727]"]
[null,"[728]","",null,0,0,0,0,"",null,0,"",null,0,"",null,0,"[728]"]
[null,"[729]","",null,0,0,0,0,"",null,0,"",null,0,"",null,0,"[729]"]
[null,"[730]","",null,0,0,0,0,"",null,0,"",null,0,"",null,0,"[730]"]
[null,"[731]","",null,0,0,0,0,"",null,0,"",null,0,"",null,0,"[731]"]
[null,"[732]","",null,0,0,0,0,"",null,0,"",null,0,"",null,0,"[732]"]
[null,"[733]","",null,0,0,0,0,"",null,0,"",null,0,"",null,0,"[733]"]
[null,"[734]","",null,0,0,0,0,"",null,0,"",null,0,"",null,0,"[734]"]
[null,"[735]","",null,0,0,0,0,"",null,0,"",null,0,"",null,0,"[735]"]
[null,"[736]","",null,0,0,0,0,"",null,0,"",null,0,"",null,0,"[736]"]
[null,"[737]","",null,0,0,0,0,"",null,0,"",null,0,"",null,0,"[737]"]
[null,"[738]","",null,0,0,0,0,"",null,0,"",null,0,"",null,0,"[738]"]
[null,"[739]","",null,0,0,0,0,"",null,0,"",null,0,"",null,0,"[739]"]
[null,"[740]","",null,0,0,0,0,"",null,0,"",null,0,"",null,0,"[740]"]
[null,"[741]","",null,0,0,0,0,"",null,0,"",null,0,"",null,0,"[741]"]
[null,"[742]","",null,0,0,0,0,"",null,0,"",null,0,"",null,0,"[742]"]
[null,"[743]","",null,0,0,0,0,"",null,0,"",null,0,"",null,0,"[743]"]
[null,"[744]","",null,0,0,0,0,"",null,0,"",null,0,"",null,0,"[744]"]
[null,"[745]","",null,0,0,0,0,"",null,0,"",null,0,"",null,0,"[745]"]
[null,"[746]","",null,0,0,0,0,"",null,0,"",null,0,"",null,0,"[746]"]
[null,"[747]","",null,0,0,0,0,"",null,0,"",null,0,"",null,0,"[747]"]
[null,"[748]","",null,0,0,0,0,"",null,0,"",null,0,"",null,0,"[748]"]
[null,"[749]","",null,0,0,0,0,"",null,0,"",null,0,"",null,0,"[749]"]
[null,"[750]","",null,0,0,0,0,"",null,0,"",null,0,"",null,0,"[750]"]
[null,"[751]","",null,0,0,0,0,"",null,0,"",null,0,"",null,0,"[751]"]
[null,"[752]","",null,0,0,0,0,"",null,0,"",null,0,"",null,0,"[752]"]
[null,"[753]","",null,0,0,0,0,"",null,0,"",null,0,"",null,0,"[753]"]
[null,"[754]","",null,0,0,0,0,"",null,0,"",null,0,"",null,0,"[754]"]
[null,"[755]","",null,0,0,0,0,"",null,0,"",null,0,"",null,0,"[755]"]
[null,"[756]","",null,0,0,0,0,"",null,0,"",null,0,"",null,0,"[756]"]
[null,"[757]","",null,0,0,0,0,"",null,0,"",null,0,"",null,0,"[757]"]
[null,"[758]","",null,0,0,0,0,"",null,0,"",null,0,"",null,0,"[758]"]
[null,"[759]","",null,0,0,0,0,"",null,0,"",null,0,"",null,0,"[759]"]
[null,"[760]","",null,0,0,0,0,"",null,0,"",null,0,"",null,0,"[760]"]
[null,"[761]","",null,0,0,0,0,"",null,0,"",null,0,"",null,0,"[761]"]
[null,"[762]","",null,0,0,0,0,"",null,0,"",null,0,"",null,0,"[762]"]
[null,"[763]","",null,0,0,0,0,"",null,0,"",null,0,"",null,0,"[763]"]
[null,"[764]","",null,0,0,0,0,"",null,0,"",null,0,"",null,0,"[764]"]
[null,"[765]","",null,0,0,0,0,"",null,0,"",null,0,"",null,0,"[765]"]
[null,"[766]","",null,0,0,0,0,"",null,0,"",null,0,"",null,0,"[766]"]
[null,"[767]","",null,0,0,0,0,"",null,0,"",null,0,"",null,0,"[767]"]
[null,"[768]","",null,0,0,0,0,"",null,0,"",null,0,"",null,0,"[768]"]
[null,"[769]","",null,0,0,0,0,"",null,0,"",null,0,"",null,0,"[769]"]
[null,"[770]","",null,0,0,0,0,"",null,0,"",null,0,"",null,0,"[770]"]
[null,"[771]","",null,0,0,0,0,"",null,0,"",null,0,"",null,0,"[771]"]
[null,"[772]","",null,0,0,0,0,"",null,0,"",null,0,"",null,0,"[772]"]
[null,"[773]","",null,0,0,0,0,"",null,0,"",null,0,"",null,0,"[773]"]
[null,"[774]","",null,0,0,0,0,"",null,0,"",null,0,"",null,0,"[774]"]
[null,"[775]","",null,0,0,0,0,"",null,0,"",null,0,"",null,0,"[775]"]
[null,"[776]","",null,0,0,0,0,"",null,0,"",null,0,"",null,0,"[776]"]
[null,"[777]","",null,0,0,0,0,"",null,0,"",null,0,"",null,0,"[777]"]
[null,"[778]","",null,0,0,0,0,"",null,0,"",null,0,"",null,0,"[778]"]
[null,"[779]","",null,0,0,0,0,"",null,0,"",null,0,"",null,0,"[779]"]
[null,"[780]","",null,0,0,0,0,"",null,0,"",null,0,"",null,0,"[780]"]
[null,"[781]","",null,0,0,0,0,"",null,0,"",null,0,"",null,0,"[781]"]
[null,"[782]","",null,0,0,0,0,"",null,0,"",null,0,"",null,0,"[782]"]
[null,"[783]","",null,0,0,0,0,"",null,0,"",null,0,"",null,0,"[783]"]
[null,"[784]","",null,0,0,0,0,"",null,0,"",null,0,"",null,0,"[784]"]
[null,"[785]","",null,0,0,0,0,"",null,0,"",null,0,"",null,0,"[785]"]
[null,"[786]","",null,0,0,0,0,"",null,0,"",null,0,"",null,0,"[786]"]
[null,"[787]","",null,0,0,0,{"$f":"IF(F798=0,0,(E798/F798)*100)","v":0},"",null,0,"",null,0,"",null,0,"[787]"]
[null,"[788]","",null,0,0,0,0,"",null,0,"",null,0,"",null,0,"[788]"]
[null,"[789]","",null,0,0,0,0,"",null,0,"",null,0,"",null,0,"[789]"]
[null,"[790]","",null,0,0,0,0,"",null,0,"",null,0,"",null,0,"[790]"]
[null,"[791]","",null,0,0,0,0,"",null,0,"",null,0,"",null,0,"[791]"]
[null,"[792]","",null,0,0,0,0,"",null,0,"",null,0,"",null,0,"[792]"]
[null,"[793]","",null,0,0,0,0,"",null,0,"",null,0,"",null,0,"[793]"]
[null,"[794]","",null,0,0,0,0,"",null,0,"",null,0,"",null,0,"[794]"]
[null,"[795]","",null,0,0,0,0,"",null,0,"",null,0,"",null,0,"[795]"]
[null,"[796]","",null,0,0,0,0,"",null,0,"",null,0,"",null,0,"[796]"]
[null,"[797]","",null,0,0,0,0,"",null,0,"",null,0,"",null,0,"[797]"]
[null,"[798]","",null,0,0,0,0,"",null,0,"",null,0,"",null,0,"[798]"]
[null,"[799]","",null,0,0,0,0,"",null,0,"",null,0,"",null,0,"[799]"]
[null,"[800]","",null,0,0,0,0,"",null,0,"",null,0,"",null,0,"[800]"]
[null,"[801]","",null,0,0,0,0,"",null,0,"",null,0,"",null,0,"[801]"]
[null,"[802]","",null,0,0,0,0,"",null,0,"",null,0,"",null,0,"[802]"]
[null,"[803]","",null,0,0,0,0,"",null,0,"",null,0,"",null,0,"[803]"]
[null,"[804]","",null,0,0,0,0,"",null,0,"",null,0,"",null,0,"[804]"]
[null,"[805]","",null,0,0,0,0,"",null,0,"",null,0,"",null,0,"[805]"]
[null,"[806]","",null,0,0,0,0,"",null,0,"",null,0,"",null,0,"[806]"]
[null,"[807]","",null,0,0,0,0,"",null,0,"",null,0,"",null,0,"[807]"]
[null,"[808]","",null,0,0,0,0,"",null,0,"",null,0,"",null,0,"[808]"]
[null,"[809]","",null,0,0,0,0,"",null,0,"",null,0,"",null,0,"[809]"]
[null,"[810]","",null,0,0,0,0,"",null,0,"",null,0,"",null,0,"[810]"]
[null,"[811]","",null,0,0,0,0,"",null,0,"",null,0,"",null,0,"[811]"]
[null,"[812]","",null,0,0,0,0,"",null,0,"",null,0,"",null,0,"[812]"]
[null,"[813]","",null,0,0,0,0,"",null,0,"",null,0,"",null,0,"[813]"]
[null,"[814]","",null,0,0,0,0,"",null,0,"",null,0,"",null,0,"[814]"]
[null,"[815]","",null,0,0,0,0,"",null,0,"",null,0,"",null,0,"[815]"]
[null,"[816]","",null,0,0,0,0,"",null,0,"",null,0,"",null,0,"[816]"]
[null,"[817]","",null,0,0,0,0,"",null,0,"",null,0,"",null,0,"[817]"]
[null,"[818]","",null,0,0,0,0,"",null,0,"",null,0,"",null,0,"[818]"]
[null,"[819]","",null,0,0,0,0,"",null,0,"",null,0,"",null,0,"[819]"]
[null,"[820]","",null,0,0,0,0,"",null,0,"",null,0,"",null,0,"[820]"]
[null,"[821]","",null,0,0,0,0,"",null,0,"",null,0,"",null,0,"[821]"]
[null,"[822]","",null,0,0,0,0,"",null,0,"",null,0,"",null,0,"[822]"]
[null,"[823]","",null,0,0,0,0,"",null,0,"",null,0,"",null,0,"[823]"]
[null,"[824]","",null,0,0,0,0,"",null,0,"",null,0,"",null,0,"[824]"]
[null,"[825]","",null,0,0,0,0,"",null,0,"",null,0,"",null,0,"[825]"]
[null,"[826]","",null,0,0,0,0,"",null,0,"",null,0,"",null,0,"[826]"]
[null,"[827]","",null,0,0,0,0,"",null,0,"",null,0,"",null,0,"[827]"]
[null,"[828]","",null,0,0,0,0,"",null,0,"",null,0,"",null,0,"[828]"]
[null,"[829]","",null,0,0,0,0,"",null,0,"",null,0,"",null,0,"[829]"]
[null,"[830]","",null,0,0,0,0,"",null,0,"",null,0,"",null,0,"[830]"]
[null,"[831]","",null,0,0,0,0,"",null,0,"",null,0,"",null,0,"[831]"]
[null,"[832]","",null,0,0,0,0,"",null,0,"",null,0,"",null,0,"[832]"]
[null,"[833]","",null,0,0,0,0,"",null,0,"",null,0,"",null,0,"[833]"]
[null,"[834]","",null,0,0,0,0,"",null,0,"",null,0,"",null,0,"[834]"]
[null,"[835]","",null,0,0,0,0,"",null,0,"",null,0,"",null,0,"[835]"]
[null,"[836]","",null,0,0,0,0,"",null,0,"",null,0,"",null,0,"[836]"]
[null,"[837]","",null,0,0,0,0,"",null,0,"",null,0,"",null,0,"[837]"]
[null,"[838]","",null,0,0,0,0,"",null,0,"",null,0,"",null,0,"[838]"]
[null,"[839]","",null,0,0,0,0,"",null,0,"",null,0,"",null,0,"[839]"]
[null,"[840]","",null,0,0,0,0,"",null,0,"",null,0,"",null,0,"[840]"]
[null,"[841]","",null,0,0,0,0,"",null,0,"",null,0,"",null,0,"[841]"]
[null,"[842]","",null,0,0,0,0,"",null,0,"",null,0,"",null,0,"[842]"]
[null,"[843]","",null,0,0,0,0,"",null,0,"",null,0,"",null,0,"[843]"]
[null,"[844]","",null,0,0,0,0,"",null,0,"",null,0,"",null,0,"[844]"]
[null,"[845]","",null,0,0,0,0,"",null,0,"",null,0,"",null,0,"[845]"]
[null,"[846]","",null,0,0,0,0,"",null,0,"",null,0,"",null,0,"[846]"]
[null,"[847]","",null,0,0,0,0,"",null,0,"",null,0,"",null,0,"[847]"]
[null,"[848]","",null,0,0,0,0,"",null,0,"",null,0,"",null,0,"[848]"]
[null,"[849]","",null,0,0,0,0,"",null,0,"",null,0,"",null,0,"[849]"]
[null,"[850]","",null,0,0,0,0,"",null,0,"",null,0,"",null,0,"[850]"]
[null,"[851]","",null,0,0,0,{"$f":"IF(F862=0,0,(E862/F862)*100)","v":0},"",null,0,"",null,0,"",null,0,"[851]"]
[null,"[852]","",null,0,0,0,0,"",null,0,"",null,0,"",null,0,"[852]"]
[null,"[853]","",null,0,0,0,0,"",null,0,"",null,0,"",null,0,"[853]"]
[null,"[854]","",null,0,0,0,0,"",null,0,"",null,0,"",null,0,"[854]"]
[null,"[855]","",null,0,0,0,0,"",null,0,"",null,0,"",null,0,"[855]"]
[null,"[856]","",null,0,0,0,0,"",null,0,"",null,0,"",null,0,"[856]"]
[null,"[857]","",null,0,0,0,0,"",null,0,"",null,0,"",null,0,"[857]"]
[null,"[858]","",null,0,0,0,0,"",null,0,"",null,0,"",null,0,"[858]"]
[null,"[859]","",null,0,0,0,0,"",null,0,"",null,0,"",null,0,"[859]"]
[null,"[860]","",null,0,0,0,0,"",null,0,"",null,0,"",null,0,"[860]"]
[null,"[861]","",null,0,0,0,0,"",null,0,"",null,0,"",null,0,"[861]"]
[null,"[862]","",null,0,0,0,0,"",null,0,"",null,0,"",null,0,"[862]"]
[null,"[863]","",null,0,0,0,0,"",null,0,"",null,0,"",null,0,"[863]"]
[null,"[864]","",null,0,0,0,0,"",null,0,"",null,0,"",null,0,"[864]"]
[null,"[865]","",null,0,0,0,0,"",null,0,"",null,0,"",null,0,"[865]"]
[null,"[866]","",null,0,0,0,0,"",null,0,"",null,0,"",null,0,"[866]"]
[null,"[867]","",null,0,0,0,0,"",null,0,"",null,0,"",null,0,"[867]"]
[null,"[868]","",null,0,0,0,0,"",null,0,"",null,0,"",null,0,"[868]"]
[null,"[869]","",null,0,0,0,0,"",null,0,"",null,0,"",null,0,"[869]"]
[null,"[870]","",null,0,0,0,0,"",null,0,"",null,0,"",null,0,"[870]"]
[null,"[871]","",null,0,0,0,0,"",null,0,"",null,0,"",null,0,"[871]"]
[null,"[872]","",null,0,0,0,0,"",null,0,"",null,0,"",null,0,"[872]"]
[null,"[873]","",null,0,0,0,0,"",null,0,"",null,0,"",null,0,"[873]"]
[null,"[874]","",null,0,0,0,0,"",null,0,"",null,0,"",null,0,"[874]"]
[null,"[875]","",null,0,0,0,0,"",null,0,"",null,0,"",null,0,"[875]"]
[null,"[876]","",null,0,0,0,0,"",null,0,"",null,0,"",null,0,"[876]"]
[null,"[877]","",null,0,0,0,0,"",null,0,"",null,0,"",null,0,"[877]"]
[null,"[878]","",null,0,0,0,0,"",null,0,"",null,0,"",null,0,"[878]"]
[null,"[879]","",null,0,0,0,0,"",null,0,"",null,0,"",null,0,"[879]"]
[null,"[880]","",null,0,0,0,0,"",null,0,"",null,0,"",null,0,"[880]"]
[null,"[881]","",null,0,0,0,0,"",null,0,"",null,0,"",null,0,"[881]"]
[null,"[882]","",null,0,0,0,0,"",null,0,"",null,0,"",null,0,"[882]"]
[null,"[883]","",null,0,0,0,0,"",null,0,"",null,0,"",null,0,"[883]"]
[null,"[884]","",null,0,0,0,0,"",null,0,"",null,0,"",null,0,"[884]"]
[null,"[885]","",null,0,0,0,0,"",null,0,"",null,0,"",null,0,"[885]"]
[null,"[886]","",null,0,0,0,0,"",null,0,"",null,0,"",null,0,"[886]"]
[null,"[887]","",null,0,0,0,0,"",null,0,"",null,0,"",null,0,"[887]"]
[null,"[888]","",null,0,0,0,0,"",null,0,"",null,0,"",null,0,"[888]"]
[null,"[889]","",null,0,0,0,0,"",null,0,"",null,0,"",null,0,"[889]"]
[null,"[890]","",null,0,0,0,0,"",null,0,"",null,0,"",null,0,"[890]"]
[null,"[891]","",null,0,0,0,0,"",null,0,"",null,0,"",null,0,"[891]"]
[null,"[892]","",null,0,0,0,0,"",null,0,"",null,0,"",null,0,"[892]"]
[null,"[893]","",null,0,0,0,0,"",null,0,"",null,0,"",null,0,"[893]"]
[null,"[894]","",null,0,0,0,0,"",null,0,"",null,0,"",null,0,"[894]"]
[null,"[895]","",null,0,0,0,0,"",null,0,"",null,0,"",null,0,"[895]"]
[null,"[896]","",null,0,0,0,0,"",null,0,"",null,0,"",null,0,"[896]"]
[null,"[897]","",null,0,0,0,0,"",null,0,"",null,0,"",null,0,"[897]"]
[null,"[898]","",null,0,0,0,0,"",null,0,"",null,0,"",null,0,"[898]"]
[null,"[899]","",null,0,0,0,0,"",null,0,"",null,0,"",null,0,"[899]"]
[null,"[900]","",null,0,0,0,0,"",null,0,"",null,0,"",null,0,"[900]"]
[null,"[901]","",null,0,0,0,0,"",null,0,"",null,0,"",null,0,"[901]"]
[null,"[902]","",null,0,0,0,0,"",null,0,"",null,0,"",null,0,"[902]"]
[null,"[903]","",null,0,0,0,0,"",null,0,"",null,0,"",null,0,"[903]"]
[null,"[904]","",null,0,0,0,0,"",null,0,"",null,0,"",null,0,"[904]"]
[null,"[905]","",null,0,0,0,0,"",null,0,"",null,0,"",null,0,"[905]"]
[null,"[906]","",null,0,0,0,0,"",null,0,"",null,0,"",null,0,"[906]"]
[null,"[907]","",null,0,0,0,0,"",null,0,"",null,0,"",null,0,"[907]"]
[null,"[908]","",null,0,0,0,0,"",null,0,"",null,0,"",null,0,"[908]"]
[null,"[909]","",null,0,0,0,0,"",null,0,"",null,0,"",null,0,"[909]"]
[null,"[910]","",null,0,0,0,0,"",null,0,"",null,0,"",null,0,"[910]"]
[null,"[911]","",null,0,0,0,0,"",null,0,"",null,0,"",null,0,"[911]"]
[null,"[912]","",null,0,0,0,0,"",null,0,"",null,0,"",null,0,"[912]"]
[null,"[913]","",null,0,0,0,0,"",null,0,"",null,0,"",null,0,"[913]"]
[null,"[914]","",null,0,0,0,0,"",null,0,"",null,0,"",null,0,"[914]"]
[null,"[915]","",null,0,0,0,{"$f":"IF(F926=0,0,(E926/F926)*100)","v":0},"",null,0,"",null,0,"",null,0,"[915]"]
[null,"[916]","",null,0,0,0,0,"",null,0,"",null,0,"",null,0,"[916]"]
[null,"[917]","",null,0,0,0,0,"",null,0,"",null,0,"",null,0,"[917]"]
[null,"[918]","",null,0,0,0,0,"",null,0,"",null,0,"",null,0,"[918]"]
[null,"[919]","",null,0,0,0,0,"",null,0,"",null,0,"",null,0,"[919]"]
[null,"[920]","",null,0,0,0,0,"",null,0,"",null,0,"",null,0,"[920]"]
[null,"[921]","",null,0,0,0,0,"",null,0,"",null,0,"",null,0,"[921]"]
[null,"[922]","",null,0,0,0,0,"",null,0,"",null,0,"",null,0,"[922]"]
[null,"[923]","",null,0,0,0,0,"",null,0,"",null,0,"",null,0,"[923]"]
[null,"[924]","",null,0,0,0,0,"",null,0,"",null,0,"",null,0,"[924]"]
[null,"[925]","",null,0,0,0,0,"",null,0,"",null,0,"",null,0,"[925]"]
[null,"[926]","",null,0,0,0,0,"",null,0,"",null,0,"",null,0,"[926]"]
[null,"[927]","",null,0,0,0,0,"",null,0,"",null,0,"",null,0,"[927]"]
[null,"[928]","",null,0,0,0,0,"",null,0,"",null,0,"",null,0,"[928]"]
[null,"[929]","",null,0,0,0,0,"",null,0,"",null,0,"",null,0,"[929]"]
[null,"[930]","",null,0,0,0,0,"",null,0,"",null,0,"",null,0,"[930]"]
[null,"[931]","",null,0,0,0,0,"",null,0,"",null,0,"",null,0,"[931]"]
[null,"[932]","",null,0,0,0,0,"",null,0,"",null,0,"",null,0,"[932]"]
[null,"[933]","",null,0,0,0,0,"",null,0,"",null,0,"",null,0,"[933]"]
[null,"[934]","",null,0,0,0,0,"",null,0,"",null,0,"",null,0,"[934]"]
[null,"[935]","",null,0,0,0,0,"",null,0,"",null,0,"",null,0,"[935]"]
[null,"[936]","",null,0,0,0,0,"",null,0,"",null,0,"",null,0,"[936]"]
[null,"[937]","",null,0,0,0,0,"",null,0,"",null,0,"",null,0,"[937]"]
[null,"[938]","",null,0,0,0,0,"",null,0,"",null,0,"",null,0,"[938]"]
[null,"[939]","",null,0,0,0,0,"",null,0,"",null,0,"",null,0,"[939]"]
[null,"[940]","",null,0,0,0,0,"",null,0,"",null,0,"",null,0,"[940]"]
[null,"[941]","",null,0,0,0,0,"",null,0,"",null,0,"",null,0,"[941]"]
[null,"[942]","",null,0,0,0,0,"",null,0,"",null,0,"",null,0,"[942]"]
[null,"[943]","",null,0,0,0,0,"",null,0,"",null,0,"",null,0,"[943]"]
[null,"[944]","",null,0,0,0,0,"",null,0,"",null,0,"",null,0,"[944]"]
[null,"[945]","",null,0,0,0,0,"",null,0,"",null,0,"",null,0,"[945]"]
[null,"[946]","",null,0,0,0,0,"",null,0,"",null,0,"",null,0,"[946]"]
[null,"[947]","",null,0,0,0,0,"","",0,"","",0,"","",0,"[947]"]
[null,"[948]","",null,0,0,0,0,"","",0,"","",0,"","",0,"[948]"]
[null,"[949]","",null,0,0,0,0,"","",0,"","",0,"","",0,"[949]"]
[null,"[950]","",null,0,0,0,0,"","",0,"","",0,"","",0,"[950]"]
[null,"[951]","",null,0,0,0,0,"",null,0,"",null,0,"",null,0,"[951]"]
[null,"[952]","",null,0,0,0,0,"",null,0,"",null,0,"",null,0,"[952]"]
[null,"[953]","",null,0,0,0,0,"",null,0,"",null,0,"",null,0,"[953]"]
[null,"[954]","",null,0,0,0,0,"",null,0,"",null,0,"",null,0,"[954]"]
[null,"[955]","",null,0,0,0,0,"",null,0,"",null,0,"",null,0,"[955]"]
[null,"[956]","",null,0,0,0,0,"",null,0,"",null,0,"",null,0,"[956]"]
[null,"[957]","",null,0,0,0,0,"",null,0,"",null,0,"",null,0,"[957]"]
[null,"[958]","",null,0,0,0,0,"",null,0,"",null,0,"",null,0,"[958]"]
[null,"[959]","",null,0,0,0,0,"",null,0,"",null,0,"",null,0,"[959]"]
[null,"[960]","",null,0,0,0,0,"",null,0,"",null,0,"",null,0,"[960]"]
[null,"[961]","",null,0,0,0,0,"",null,0,"",null,0,"",null,0,"[961]"]
[null,"[962]","",null,0,0,0,0,"",null,0,"",null,0,"",null,0,"[962]"]
[null,"[963]","",null,0,0,0,0,"",null,0,"",null,0,"",null,0,"[963]"]
[null,"[964]","",null,0,0,0,0,"",null,0,"",null,0,"",null,0,"[964]"]
[null,"[965]","",null,0,0,0,0,"",null,0,"",null,0,"",null,0,"[965]"]
[null,"[966]","",null,0,0,0,{"$f":"IF(F977=0,0,(E977/F977)*100)","v":0},"",null,0,"",null,0,"",null,0,"[966]"]
[null,"[967]","",null,0,0,0,0,"",null,0,"",null,0,"",null,0,"[967]"]
[null,"[968]","",null,0,0,0,0,"",null,0,"",null,0,"",null,0,"[968]"]
[null,"[969]","",null,0,0,0,0,"",null,0,"",null,0,"",null,0,"[969]"]
[null,"[970]","",null,0,0,0,0,"",null,0,"",null,0,"",null,0,"[970]"]
[null,"[971]","",null,0,0,0,0,"",null,0,"",null,0,"",null,0,"[971]"]
[null,"[972]","",null,0,0,0,0,"",null,0,"",null,0,"",null,0,"[972]"]
[null,"[973]","",null,0,0,0,0,"",null,0,"",null,0,"",null,0,"[973]"]
[null,"[974]","",null,0,0,0,0,"",null,0,"",null,0,"",null,0,"[974]"]
[null,"[975]","",null,0,0,0,0,"",null,0,"",null,0,"",null,0,"[975]"]
[null,"[976]","",null,0,0,0,0,"",null,0,"",null,0,"",null,0,"[976]"]
[null,"[977]","",null,0,0,0,0,"",null,0,"",null,0,"",null,0,"[977]"]
[null,"[978]","",null,0,0,0,0,"",null,0,"",null,0,"",null,0,"[978]"]
[null,"[979]","",null,0,0,0,0,"",null,0,"",null,0,"",null,0,"[979]"]
[null,"[980]","",null,0,0,0,0,"",null,0,"",null,0,"",null,0,"[980]"]
[null,"[981]","",null,0,0,0,0,"",null,0,"",null,0,"",null,0,"[981]"]
[null,"[982]","",null,0,0,0,0,"",null,0,"",null,0,"",null,0,"[982]"]
[null,"[983]","",null,0,0,0,0,"",null,0,"",null,0,"",null,0,"[983]"]
[null,"[984]","",null,0,0,0,0,"",null,0,"",null,0,"",null,0,"[984]"]
[null,"[985]","",null,0,0,0,0,"",null,0,"",null,0,"",null,0,"[985]"]
[null,"[986]","",null,0,0,0,0,"",null,0,"",null,0,"",null,0,"[986]"]
[null,"[987]","",null,0,0,0,0,"",null,0,"",null,0,"",null,0,"[987]"]
[null,"[988]","",null,0,0,0,0,"",null,0,"",null,0,"",null,0,"[988]"]
[null,"[989]","",null,0,0,0,0,"",null,0,"",null,0,"",null,0,"[989]"]
[null,"[990]","",null,0,0,0,0,"",null,0,"",null,0,"",null,0,"[990]"]
[null,"[991]","",null,0,0,0,0,"",null,0,"",null,0,"",null,0,"[991]"]
[null,"[992]","",null,0,0,0,0,"",null,0,"",null,0,"",null,0,"[992]"]
[null,"[993]","",null,0,0,0,0,"",null,0,"",null,0,"",null,0,"[993]"]
[null,"[994]","",null,0,0,0,0,"",null,0,"",null,0,"",null,0,"[994]"]
[null,"[995]","",null,0,0,0,0,"",null,0,"",null,0,"",null,0,"[995]"]
[null,"[996]","",null,0,0,0,0,"",null,0,"",null,0,"",null,0,"[996]"]
[null,"[997]","",null,0,0,0,0,"",null,0,"",null,0,"",null,0,"[997]"]
[null,"[998]","",null,0,0,0,0,"","",0,"","",0,"","",0,"[998]"]
[null,"[999]","",null,0,0,0,0,"","",0,"","",0,"","",0,"[999]"]
[null,"[1000]","",null,0,0,0,0,"","",0,"","",0,"","",0,"[1000]"]
[null,null,"Sub-total","[4000]",{"$f":"SUM(E12:E61)","v":0},{"$f":"SUM(F12:F61)","v":0},{"$f":"SUM(G12:G61)","v":0},"[4002]"]
[null,null,"Other borrowing margin clients","[4003]",0,0,0,"[4005]"]
[null,null,"Less: General provision for bad or doubtful debts for all margin clients, if any (Note 4)","[4006]",0,null,0,"[4007]"]
[null,null,"Total loan balance after general provision for bad or doubtful debts, if any (Note 4)","[4008]",{"$f":"E1012+E1013-E1014","v":0},{"$f":"F1012+F1013","v":0},{"$f":"G1012+G1013-G1014","v":0},"[4010]"]
[]
[null," Note 1:","Unadjusted loan balance means the loan balance receivable from each margin client after deducting any specific provision for bad or doubtful debts.  Adjusted loan balance is the amount of loan balance which can be included in liquid assets before deducting any adjustment for concentration of margin clients."]
[null," Note 2:","Where the total unadjusted loan balance exceeds HK$1,000,000,000, please provide the information of the top 50 margin clients. Otherwise, please provide the information of the top 20 margin clients."]
[]
[null," Note 3:","Please enter the stock code in case of securities listed on the recognized stock market, or sedol number or ISIN code in case of other securities."]
[]
[null," Note 4:","(i) Please note that normally no amount is to be reported for general provision for bad or doubtful debts in cell 4007 since the aggregate of amounts reported under cells 4002 and 4005 will represent the\n     total adjusted balance of margin loan receivable to be included as liquid assets.  However, according to section 22(3) of the Securities and Futures (Financial Resources) Rules, where the aggregate of\n     amounts reported under cells 4002 and 4005 exceeds total margin loan receivable less the aggregate of amounts of specific and general provisions for bad or doubtful debts (i.e. cell 4008), a balancing\n     figure may be required under cell 4007 such that the total adjusted loan balance included as liquid assets (i.e. cell 4010) shall equal to total margin loan receivable less the aggregate of amounts of\n     specific and general provisions for bad or doubtful debts (i.e. cell 4008), if any.\n\n     Total unadjusted loan balance and total adjusted loan balance after general provision for bad or doubtful debts should equal to the amounts reported in cell 1012 and cell 1011 respectively."]
[null,null,"(ii) Where the total amount of outstanding margin call of all margin clients exceeds 25% of the shareholders' funds reported in cell 1106, please provide the following analysis on age of outstanding margin\n      calls as of the end of reporting month:"]
[]
[null,null,"Age of outstanding \nmargin calls","Amount of outstanding margin calls\n(HK$'000)"]
[null,null,"      Within 90 days",0,null,"[4011]"]
[null,null,"      Over 90 days",0,null,"[4012]"]
[null,null,"      Total",{"$f":"D1026+D1027","v":0},null,"[4013]"]
[]
[null,null,"     For the purpose of this form, for a margin account which had an amount of outstanding margin call as of the end of reporting month, the age of outstanding margin call should be counted from the first\n     date the account has an amount of outstanding margin call."]

{"sheet":"Form 4 Table 2","index":7,"n_rows":45,"n_cols":6,"rows_kept":45,"cut":false,"hidden":false,"merged":[[42,2,43,5],[44,2,44,5]]}
[{"$f":"IF(ISBLANK('Form 1 Main'!G14),\"\",\"Financial return of\")&\" \"&IF(ISBLANK('Form 1 Main'!G14),\"\",'Form 1 Main'!G14)","v":"Financial return of "},null,null,null,null,{"$f":"IF(ISBLANK(Config!C7),\"\",Config!C7)","v":""}]
[null,"FORM 4","MARGIN CLIENT ANALYSIS"]
[]
[null,"Table 2","By adjusted loan balance as of the end of reporting month",null,{"$f":"IF(ISBLANK('Form 1 Main'!L21),\"\",'Form 1 Main'!L21)","v":""},"[1004]"]
[]
[]
[null,"Margin clients with adjusted loan balances larger than 10% of total adjusted loan balance as of the end of reporting month"]
[]
[null,"Row","Group number (Note 1)","Name of client (Note 2)","Adjusted loan balance\n(HK$'000)","Row"]
[null,"[1]",null,"",0,"[1]"]
[null,"[2]",null,"",0,"[2]"]
[null,"[3]",null,"",0,"[3]"]
[null,"[4]",null,"",0,"[4]"]
[null,"[5]",null,"",0,"[5]"]
[null,"[6]",null,"",0,"[6]"]
[null,"[7]",null,"",0,"[7]"]
[null,"[8]",null,"",0,"[8]"]
[null,"[9]",null,"",0,"[9]"]
[null,"[10]",null,"",0,"[10]"]
[null,"[11]",null,"",0,"[11]"]
[null,"[12]",null,"",0,"[12]"]
[null,"[13]",null,"",0,"[13]"]
[null,"[14]",null,"",0,"[14]"]
[null,"[15]",null,"",0,"[15]"]
[null,"[16]",null,"",0,"[16]"]
[null,"[17]",null,"",0,"[17]"]
[null,"[18]",null,"",0,"[18]"]
[null,"[19]",null,"",0,"[19]"]
[null,"[20]",null,"",0,"[20]"]
[null,"[21]",null,"",0,"[21]"]
[null,"[22]",null,"",0,"[22]"]
[null,"[23]",null,"",0,"[23]"]
[null,"[24]",null,"",0,"[24]"]
[null,"[25]",null,"",0,"[25]"]
[null,"[26]",null,"",0,"[26]"]
[null,"[27]",null,"",0,"[27]"]
[null,"[28]",null,"",0,"[28]"]
[null,"[29]",null,"",0,"[29]"]
[null,"[30]",null,"",0,"[30]"]
[null,null,"Total",null,{"$f":"SUM(E10:E39)","v":0},"[4100]"]
[]
[]
[null,"Note 1:","To classify into groups of related margin clients, if any.  For each group of related margin clients, please assign a group number in ascending order, i.e. input “1” for group 1, “2” for group 2 and so on."]
[]
[null,"Note 2:","To provide name of each related client within a group of related margin clients where total adjusted loan balance of the group is larger than 10% of total adjusted loan balance of all margin clients."]

{"sheet":"Form 5","index":8,"n_rows":76,"n_cols":7,"rows_kept":76,"cut":false,"hidden":false,"merged":[[30,2,30,3],[31,2,31,3],[25,2,25,3],[26,2,26,3],[27,2,27,3],[28,2,28,3],[29,2,29,3],[5,2,5,3],[53,2,53,3],[54,2,54,3],[55,2,55,3],[37,2,37,3],[38,2,38,3],[39,2,39,3],[40,2,40,3],[18,2,18,3],[19,2,19,3],[20,2,20,3],[21,2,21,3],[22,2,22,3],[23,2,23,3],[24,2,24,3],[32,2,32,3],[1,1,1,4],[73,2,73,6],[6,2,6,3],[7,2,7,3],[8,2,8,3],[9,2,9,3],[10,2,10,3],[11,2,11,3],[12,2,12,3],[13,2,13,3],[14,2,14,3],[15,2,15,3],[16,2,16,3],[17,2,17,3],[46,2,46,3],[47,2,47,3],[33,2,33,3],[34,2,34,3],[35,2,35,3],[71,2,71,5],[41,2,41,3],[42,2,42,3],[43,2,43,3],[44,2,44,3],[45,2,45,3],[36,2,36,3],[63,2,63,3],[64,2,64,3],[65,2,65,3],[57,2,57,3],[62,2,62,3],[77,2,77,5],[51,2,51,3],[52,2,52,3],[48,2,48,3],[49,2,49,3],[50,2,50,3],[75,2,75,6],[56,2,56,3],[58,2,58,3],[59,2,59,3],[60,2,60,3],[61,2,61,3]]}
[{"$f":"IF(ISBLANK('Form 1 Main'!G14),\"\",\"Financial return of\")&\" \"&IF(ISBLANK('Form 1 Main'!G14),\"\",'Form 1 Main'!G14)","v":"Financial return of "},null,null,null,null,null,{"$f":"IF(ISBLANK(Config!C7),\"\",Config!C7)","v":""}]
[null,"FORM 5  ANALYSIS OF SECURITIES COLLATERAL"]
[null,null,"    AS OF THE END OF REPORTING MONTH",null,null,{"$f":"IF(ISBLANK('Form 1 Main'!L21),\"\",'Form 1 Main'!L21)","v":""},"[1004]"]
[]
[null,null,"Name\n",null,"Stock code / \nsedol no. / \nISIN code\n (Note 2)\n","Market value\n (HK$'000)\n(Note 3)"]
[null,"Row","Securities collateral subject to 80% illiquid collateral haircut (Note 1)    ",null,null,null,"Row"]
[null,"[1]","",null,"",0,"[1]"]
[null,"[2]","",null,"",0,"[2]"]
[null,"[3]","",null,"",0,"[3]"]
[null,"[4]","",null,"",0,"[4]"]
[null,"[5]","",null,"",0,"[5]"]
[null,"[6]","",null,"",0,"[6]"]
[null,"[7]","",null,"",0,"[7]"]
[null,"[8]","",null,"",0,"[8]"]
[null,"[9]","",null,"",0,"[9]"]
[null,"[10]","",null,"",0,"[10]"]
[null,"[11]","",null,"",0,"[11]"]
[null,"[12]","",null,"",0,"[12]"]
[null,"[13]","",null,"",0,"[13]"]
[null,"[14]","",null,"",0,"[14]"]
[null,"[15]","",null,"",0,"[15]"]
[null,"[16]","",null,"",0,"[16]"]
[null,"[17]","",null,"",0,"[17]"]
[null,"[18]","",null,"",0,"[18]"]
[null,"[19]","",null,"",0,"[19]"]
[null,"[20]","",null,"",0,"[20]"]
[null,"[21]","",null,"",0,"[21]"]
[null,"[22]","",null,"",0,"[22]"]
[null,"[23]","",null,"",0,"[23]"]
[null,"[24]","",null,"",0,"[24]"]
[null,"[25]","",null,"",0,"[25]"]
[null,"[26]","",null,"",0,"[26]"]
[null,"[27]","",null,"",0,"[27]"]
[null,"[28]","",null,"",0,"[28]"]
[null,"[29]","",null,"",0,"[29]"]
[null,"[30]","",null,"",0,"[30]"]
[null,"[31]","",null,"",0,"[31]"]
[null,"[32]","",null,"",0,"[32]"]
[null,"[33]","",null,"",0,"[33]"]
[null,"[34]","",null,"",0,"[34]"]
[null,"[35]","",null,"",0,"[35]"]
[null,"[36]","",null,"",0,"[36]"]
[null,"[37]","",null,"",0,"[37]"]
[null,"[38]","",null,"",0,"[38]"]
[null,"[39]","",null,"",0,"[39]"]
[null,"[40]","",null,"",0,"[40]"]
[null,"[41]","",null,"",0,"[41]"]
[null,"[42]","",null,"",0,"[42]"]
[null,"[43]","",null,"",0,"[43]"]
[null,"[44]","",null,"",0,"[44]"]
[null,"[45]","",null,"",0,"[45]"]
[null,"[46]","",null,"",0,"[46]"]
[null,"[47]","",null,"",0,"[47]"]
[null,"[48]","",null,"",0,"[48]"]
[null,"[49]","",null,"",0,"[49]"]
[null,"[50]","",null,"",0,"[50]"]
[null,{"$f":"\"[\"&(ROW()-6)&\"]\"","v":"[51]"},"",null,"",0,{"$f":"B57","v":"[51]"}]
[null,{"$f":"\"[\"&(ROW()-6)&\"]\"","v":"[52]"},"",null,"",0,{"$f":"B58","v":"[52]"}]
[null,"[53]","",null,"",0,"[53]"]
[null,"[54]","",null,"",0,"[54]"]
[null,"[55]","",null,"",0,"[55]"]
[null,"[56]","",null,"",0,"[56]"]
[null,"[57]","",null,"",0,"[57]"]
[null,"[58]","",null,"",0,"[58]"]
[null,"[59]","",null,"",0,"[59]"]
[null,"[60]","",null,"",0,"[60]"]
[null,null,"Total",null,null,{"$f":"SUM(F7:F66)","v":0},"[5003]"]
[]
[]
[]
[]
[null,"Note 1:","Starting from the securities with the highest market value."]
[]
[null,"Note 2:","Please enter the stock code in case of securities listed on the recognized stock market, or sedol number or ISIN code in case of other securities."]
[]
[null,"Note 3:","Securities collateral of all margin clients, whether borrowing or non-borrowing, should be included for the purpose of this analysis."]

{"sheet":"Form 6","index":9,"n_rows":41,"n_cols":20,"rows_kept":41,"cut":false,"hidden":false,"merged":[[4,2,6,2],[4,5,6,5],[4,6,6,6],[5,12,5,14],[5,9,5,11],[25,3,25,4],[26,3,26,4],[4,8,6,8],[12,3,12,4],[1,12,1,13],[24,3,24,4],[7,3,7,4],[8,3,8,4],[9,3,9,4],[10,3,10,4],[11,3,11,4],[20,3,20,4],[21,3,21,4],[22,3,22,4],[23,3,23,4],[40,3,40,17],[36,3,36,17],[43,3,43,17],[41,3,41,17],[4,7,6,7],[4,3,6,4],[5,15,5,17],[28,6,29,6],[13,3,13,4],[14,3,14,4],[15,3,15,4],[16,3,16,4],[17,3,17,4],[18,3,18,4],[19,3,19,4],[28,5,29,5],[28,18,29,18],[30,5,31,5],[30,6,31,6],[35,3,35,17],[30,18,31,18],[32,5,33,5],[32,6,33,6],[32,7,33,7],[32,18,33,18],[30,2,31,3],[32,2,33,3],[30,7,31,7],[28,7,29,7],[28,2,29,3]]}
[{"$f":"IF(ISBLANK('Form 1 Main'!G14),\"\",\"Financial return of\")&\" \"&IF(ISBLANK('Form 1 Main'!G14),\"\",'Form 1 Main'!G14)","v":"Financial return of "},null,null,null,null,null,null,null,null,null,null,null,null,null,null,null,null,null,""]
[null,"FORM 6",null,"ROLLING BALANCE CASH CLIENT ANALYSIS AS OF THE END OF REPORTING MONTH",null,null,null,null,null,null,null,null,{"$f":"IF(ISBLANK('Form 1 Main'!L21),\"\",'Form 1 Main'!L21)","v":""},null,"[1004]"]
[null,"Top 20 rolling balance cash clients ranked in descending order of the net debit balance as of the end of reporting month",null,null,null,null,null,null,null,null,null,null,null,null,null,null,null,null,null,""]
[]
[null,null,"Ranking","Name of client\n",null,"Account balance\n(Note 1)\n(HK$'000)\n","Market value of securities holdings\n(HK$'000)\n","Adjusted balance \n(Note 2)\n(HK$'000)\n","Ratio of account balance to market value of securities holdings\n(%)\n",null,null,null,null,"Top 3 securities (Note 3)"]
[null,null,null,null,null,null,null,null,null,"Security 1",null,null,"Security 2",null,null,"Security 3"]
[null,"Row",null,null,null,null,null,null,null,"Name\n","Stock code / sedol no. / ISIN code\n","Market value\n(HK$'000)\n","Name\n","Stock code / sedol no. / ISIN code\n","Market value\n(HK$'000)\n","Name\n","Stock code / sedol no. / ISIN code\n","Market value\n(HK$'000)\n","Row"]
[null,"[1]",1,"",null,0,0,0,{"$f":"IF(G8=0,0,(F8/G8)*100)","v":0},"","",0,"","",0,"","",0,"[1]"]
[null,"[2]",2,"",null,0,0,0,0,"","",0,"","",0,"","",0,"[2]"]
[null,"[3]",3,"",null,0,0,0,0,"","",0,"","",0,"","",0,"[3]"]
[null,"[4]",4,"",null,0,0,0,0,"","",0,"","",0,"","",0,"[4]"]
[null,"[5]",5,"",null,0,0,0,0,"","",0,"","",0,"","",0,"[5]"]
[null,"[6]",6,"",null,0,0,0,0,"","",0,"","",0,"","",0,"[6]"]
[null,"[7]",7,"",null,0,0,0,0,"","",0,"","",0,"","",0,"[7]"]
[null,"[8]",8,"",null,0,0,0,0,"","",0,"","",0,"","",0,"[8]"]
[null,"[9]",9,"",null,0,0,0,0,"","",0,"","",0,"","",0,"[9]"]
[null,"[10]",10,"",null,0,0,0,0,"","",0,"","",0,"","",0,"[10]"]
[null,"[11]",11,"",null,0,0,0,0,"","",0,"","",0,"","",0,"[11]"]
[null,"[12]",12,"",null,0,0,0,0,"","",0,"","",0,"","",0,"[12]"]
[null,"[13]",13,"",null,0,0,0,0,"","",0,"","",0,"","",0,"[13]"]
[null,"[14]",14,"",null,0,0,0,0,"","",0,"","",0,"","",0,"[14]"]
[null,"[15]",15,"",null,0,0,0,0,"","",0,"","",0,"","",0,"[15]"]
[null,"[16]",16,"",null,0,0,0,0,"","",0,"","",0,"","",0,"[16]"]
[null,"[17]",17,"",null,0,0,0,0,"","",0,"","",0,"","",0,"[17]"]
[null,"[18]",18,"",null,0,0,0,0,"","",0,"","",0,"","",0,"[18]"]
[null,"[19]",19,"",null,0,0,0,0,"","",0,"","",0,"","",0,"[19]"]
[null,"[20]",20,"",null,0,0,0,0,"","",0,"","",0,"","",0,"[20]"]
[null,null,"Sub-total",null,"[6000]",{"$f":"SUM(F8:F27)","v":0},{"$f":"SUM(G8:G27)","v":0},{"$f":"SUM(H8:H27)","v":0},"[6002]"]
[null,null,"Other clients with net debit balances",null,null,0,0,0]
[null,null,null,null,"[6003]",null,null,null,"[6005]"]
[null,null,"Less: General provision for bad or doubtful debts, if any (Note 4)",null,null,0,null,0]
[null,null,null,null,"[6006]",null,null,null,"[6007]"]
[null,null,"Total balance after general provision for bad or doubtful debts, if any (Note 4)",null,null,{"$f":"F28+F29-F31","v":0},{"$f":"G28+G29","v":0},{"$f":"H28+H29-H31","v":0}]
[null,null,null,null,"[6008]",null,null,null,"[6010]"]
[]
[null,null,"Note 1:","Account balance represents the net receivable from each rolling balance cash client after deducting any specific provision for bad or doubtful debts. "]
[null,null,"Note 2:","Adjusted balance is the amount which can be included in liquid assets."]
[]
[null,null,"Note 3:","Please enter the stock code in case of securities listed on the recognized stock market, or sedol number or ISIN code in case of other securities."]
[]
[null,null,"Note 4:","Please note that normally no amount is to be reported for general provision for bad or doubtful debts in cell 6007 since the aggregate of amounts reported under cells 6002 and 6005 will represent the total adjusted balance of amounts receivable from rolling balance cash clients that is to be included as liquid assets.  However, according to section 21(7) of the Securities and Futures (Financial Resources) Rules, where the aggregate of amounts reported under cells 6002 and 6005 exceeds total amount receivable from rolling balance cash clients less the aggregate of amounts of specific and general provisions for bad or doubtful debts (i.e. cell 6008), a balancing figure may be required under cell 6007 such that the total adjusted balance included as liquid assets (i.e. cell 6010) shall equal to total amount receivable from rolling balance cash clients less the aggregate of amounts of specific and general provisions for bad or doubtful debts (i.e. cell 6008), if any.\n\nTotal account balance and total adjusted balance after general provision for bad or doubtful debts should equal to the amounts reported in cell 1016 and cell 1015 respectively. "]

{"sheet":"Form 7","index":10,"n_rows":188,"n_cols":14,"rows_kept":188,"cut":false,"hidden":false,"merged":[[135,4,135,12],[133,4,133,12],[134,4,134,12],[73,1,73,2],[73,3,73,6],[132,4,132,12],[88,1,88,2],[108,12,109,12],[111,1,111,2],[111,3,111,6],[124,2,124,6],[128,2,128,6],[108,8,109,8],[108,10,109,10],[108,3,108,6],[130,4,130,12],[24,12,25,12],[24,8,25,8],[24,10,25,10],[83,12,84,12],[86,3,86,6],[83,8,84,8],[83,10,84,10],[1,10,1,11],[9,2,9,6],[16,2,16,6],[24,2,24,6],[88,3,88,6],[25,2,25,6],[83,3,83,6],[137,4,137,12],[138,4,138,12],[140,3,140,12],[142,3,142,12],[154,3,154,4],[144,3,144,4],[145,3,145,4],[147,3,147,6],[152,3,152,12],[187,3,187,12],[157,3,157,8],[173,1,173,2],[173,3,173,6],[163,1,163,2],[163,3,163,6],[160,3,160,10],[158,3,158,8],[166,3,166,8],[169,3,169,4],[179,3,179,4],[180,3,180,4],[182,3,182,6],[176,3,176,6]]}
[{"$f":"IF(ISBLANK('Form 1 Main'!G14),\"\",\"Financial return of\")&\" \"&IF(ISBLANK('Form 1 Main'!G14),\"\",'Form 1 Main'!G14)","v":"Financial return of "}]
[null,"FORM 7",null,null,"PROFIT AND LOSS ACCOUNT FOR PERIOD ENDED",null,null,null,null,null,{"$f":"IF(ISBLANK('Form 1 Main'!L21),\"\",'Form 1 Main'!L21)","v":""},null,"[1004]"]
[]
[]
[]
[null,null,null,null,null,null,null,null,"Current month",null,"Previous month",null,"Year-to-date\nsince last financial\nyear-end"]
[]
[null,null,"TURNOVER"]
[]
[null,null,"Securities dealing (other than transactions in stock options contracts) (Note 1) (in total transaction amount)",null,null,null,null,null,"(HK$'000)",null,"(HK$'000)",null,"(HK$'000)"]
[null,null,null,"-  own account",null,null,null,null,0,"[7000]",0,"[7001]",0,"[7002]"]
[null,null,null,"-  client account",null,null,null,null,0,"[7003]",0,"[7004]",0,"[7005]"]
[]
[]
[null,null,null,null,null,null,null,null,{"$f":"I11+I12","v":0},"[7006]",{"$f":"K11+K12","v":0},"[7007]",{"$f":"M11+M12","v":0},"[7008]"]
[]
[null,null,"Futures and options (including stock options contracts) dealing (Note 1b)",null,null,null,null,null,"Number of contracts",null,"Number of contracts",null,"Number of contracts"]
[null,null,null,"-  own account",null,null,null,null,0,"[7009]",0,"[7010]",0,"[7011]"]
[null,null,null,"-  client account",null,null,null,null,0,"[7012]",0,"[7013]",0,"[7014]"]
[]
[]
[null,null,null,null,null,null,null,null,{"$f":"I18+I19","v":0},"[7015]",{"$f":"K18+K19","v":0},"[7016]",{"$f":"M18+M19","v":0},"[7017]"]
[]
[null,null,null,null,null,null,null,null,"(HK$'000)",null,"(HK$'000)",null,"(HK$'000)"]
[null,null,"Leveraged foreign exchange trading (Notes 1a & 2) (in total gross principal value of contracts)",null,null,null,null,null,0,"[7018A]",0,"[7019A]",0,"[7020A]"]
[]
[]
[]
[null,null,"Virtual assets dealing "]
[null,null,null,"-  own account",null,null,null,null,0,"[7020B]",0,"[7020C]",0,"[7020D]"]
[null,null,null,"-  client account",null,null,null,null,0,"[7020E]",0,"[7020F]",0,"[7020G]"]
[]
[]
[null,null,null,null,null,null,null,null,{"$f":"I30+I31","v":0},"[7020H]",{"$f":"K30+K31","v":0},"[7020I]",{"$f":"M30+M31","v":0},"[7020J]"]
[]
[null,null,"PROFIT AND LOSS ACCOUNT",null,null,null,null,null,"(HK$'000)",null,"(HK$'000)",null,"(HK$'000)"]
[]
[null,null,"Securities dealing (Note 1b): "]
[null,null,null,"Commission income",null,null,null,null,0,"[7021]",0,"[7022]",0,"[7023]"]
[null,null,null,"Less: Commission expense (Note 3) ",null,null,null,null,0,"[7024]",0,"[7025]",0,"[7026]"]
[]
[]
[null,null,null,"Sub-total (A)",null,null,null,null,{"$f":"I39-I40","v":0},"[7027]",{"$f":"K39-K40","v":0},"[7028]",{"$f":"M39-M40","v":0},"[7029]"]
[]
[null,null,"Futures and options dealing (Note 1b):"]
[null,null,null,"Commission income",null,null,null,null,0,"[7030]",0,"[7031]",0,"[7032]"]
[null,null,null,"Less: Commission expense (Note 3) ",null,null,null,null,0,"[7033]",0,"[7034]",0,"[7035]"]
[]
[]
[null,null,null,"Sub-total (B)",null,null,null,null,{"$f":"I46-I47","v":0},"[7036]",{"$f":"K46-K47","v":0},"[7037]",{"$f":"M46-M47","v":0},"[7038]"]
[]
[null,null,"Leveraged foreign exchange trading:"]
[null,null,null,"Commission income",null,null,null,null,0,"[7039]",0,"[7040]",0,"[7041]"]
[null,null,null,"Less: Commission expense (Note 3) ",null,null,null,null,0,"[7042]",0,"[7043]",0,"[7044]"]
[]
[]
[null,null,null,"Sub-total (C)",null,null,null,null,{"$f":"I53-I54","v":0},"[7045]",{"$f":"K53-K54","v":0},"[7046]",{"$f":"M53-M54","v":0},"[7047]"]
[]
[null,null,"Virtual assets dealing "]
[null,null,null,"Commission income",null,null,null,null,0,"[7047A]",0,"[7047B]",0,"[7047C]"]
[null,null,null,"Less: Commission expense (Note 3) ",null,null,null,null,0,"[7047D]",0,"[7047E]",0,"[7047F]"]
[]
[]
[null,null,null,"Sub-total (CA)",null,null,null,null,{"$f":"I60-I61","v":0},"[7047G]",{"$f":"K60-K61","v":0},"[7047H]",{"$f":"M60-M61","v":0},"[7047I]"]
[]
[null,null,"Trading profit and loss:"]
[null,null,null,"-  in securities (Note 1b)",null,null,null,null,0,"[7048]",0,"[7049]",0,"[7050]"]
[null,null,null,"-  in futures and options contracts (Note 1b)",null,null,null,null,0,"[7051]",0,"[7052]",0,"[7053]"]
[null,null,null,"-  in leveraged foreign exchange trading ",null,null,null,null,0,"[7054]",0,"[7055]",0,"[7056]"]
[null,null,null,"-  in other foreign exchange trading",null,null,null,null,0,"[7057]",0,"[7058]",0,"[7059]"]
[null,null,null,"-  in OTC derivatives trading",null,null,null,null,0,"[7060]",0,"[7061]",0,"[7062]"]
[null,null,null,"-  in virtual assets (Note 1b)",null,null,null,null,0,"[7062A]",0,"[7062B]",0,"[7062C]"]
[null,null,null,"-  others (please specify if material) (Note 4)",null,null,null,null,0,"[7063]",0,"[7064]",0,"[7065]"]
[null,"[7063A]",null,""]
[]
[]
[null,null,null,"Sub-total (D)",null,null,null,null,{"$f":"SUM(I67:I73)","v":0},"[7066]",{"$f":"SUM(K67:K73)","v":0},"[7067]",{"$f":"SUM(M67:M73)","v":0},"[7068]"]
[null,null,"Income arising from:"]
[null,null,null,"-  underwriting and placing of securities ",null,null,null,null,0,"[7069]",0,"[7070]",0,"[7071]"]
[null,null,null,"-  advising on securities and/or futures contracts",null,null,null,null,0,"[7072]",0,"[7073]",0,"[7074]"]
[null,null,null,"-  advising on corporate finance",null,null,null,null,0,"[7075]",0,"[7076]",0,"[7077]"]
[null,null,null,"-  provision of automated trading services",null,null,null,null,0,"[7078]",0,"[7079]",0,"[7080]"]
[null,null,null,"-  provision of asset management services",null,null,null,null,0,"[7081]",0,"[7082]",0,"[7083]"]
[null,null,null,"-  management fees charged on group\n    companies (Note 5)",null,null,null,null,0,"[7084]",0,"[7085]",0,"[7086]"]
[]
[null,null,null,"-  provision of credit rating services",null,null,null,null,0,"[7086A]",0,"[7086B]",0,"[7086C]"]
[null,null,null,"-  securities borrowing and lending and\n    repurchase transactions (excluding interest\n    income)",null,null,null,null,0,"[7086D]",0,"[7086E]",0,"[7086F]"]
[null,null,null,"-  others (please specify if material) (Note 4)",null,null,null,null,0,"[7087]",0,"[7088]",0,"[7089]"]
[null,"[7087A]",null,""]
[]
[]
[null,null,null,"Sub-total (E)",null,null,null,null,{"$f":"SUM(I79:I88)","v":0},"[7090]",{"$f":"SUM(K79:K88)","v":0},"[7091]",{"$f":"SUM(M79:M88)","v":0},"[7092]"]
[]
[null,null,"Total income (F) = (A) + (B) + (C) + (CA) + (D) + (E) ",null,null,null,null,null,{"$f":"I43+I50+I57+I64+I77+I92","v":0},"[7093]",{"$f":"K43+K50+K57+K64+K77+K92","v":0},"[7094]",{"$f":"M43+M50+M57+M64+M77+M92","v":0},"[7095]"]
[]
[null,null,"Interest income/expense"]
[null,null,null,"Interest income (Note 6)",null,null,null,null,0,"[7096]",0,"[7097]",0,"[7098]"]
[null,null,null,"Less: Interest expense (Note 6)",null,null,null,null,0,"[7099]",0,"[7100]",0,"[7101]"]
[]
[]
[null,null,null,"Sub-total (G)",null,null,null,null,{"$f":"I97-I98","v":0},"[7102]",{"$f":"K97-K98","v":0},"[7103]",{"$f":"M97-M98","v":0},"[7104]"]
[]
[null,null,"Overheads"]
[null,null,null,"-  salary and staff benefits",null,null,null,null,0,"[7105]",0,"[7106]",0,"[7107]"]
[null,null,null,"-  office rental and utilities",null,null,null,null,0,"[7108]",0,"[7109]",0,"[7110]"]
[null,null,null,"-  depreciation",null,null,null,null,0,"[7111]",0,"[7112]",0,"[7113]"]
[null,null,null,"-  legal and professional expenses",null,null,null,null,0,"[7114]",0,"[7115]",0,"[7116]"]
[null,null,null,"-  provision for bad & doubtful debts",null,null,null,null,0,"[7117]",0,"[7118]",0,"[7119]"]
[null,null,null,"-  management fees charged by group\n    companies (Note 7)",null,null,null,null,0,"[7120]",0,"[7121]",0,"[7122]"]
[null,null,null,"  "]
[null,null,null,"-  others (please specify if material) (Note 4)",null,null,null,null,0,"[7123]",0,"[7124]",0,"[7125]"]
[null,"[7123A]",null,""]
[]
[]
[null,null,null,"Sub-total (H)",null,null,null,null,{"$f":"SUM(I104:I111)","v":0},"[7126]",{"$f":"SUM(K104:K111)","v":0},"[7127]",{"$f":"SUM(M104:M111)","v":0},"[7128]"]
[]
[]
[null,null,"Net profit/(loss) before tax (I) = (F) + (G) - (H)",null,null,null,null,null,{"$f":"I94+I101-I115","v":0},"[7129]",{"$f":"K94+K101-K115","v":0},"[7130]",{"$f":"M94+M101-M115","v":0},"[7131]"]
[]
[null,null,"Less: Taxation (J)",null,null,null,null,null,0,"[7132]",0,"[7133]",0,"[7134]"]
[]
[]
[null,null,"Net profit/(loss) after tax (K) = (I) - (J)",null,null,null,null,null,{"$f":"I118-I120","v":0},"[7135]",{"$f":"K118-K120","v":0},"[7136]",{"$f":"M118-M120","v":0},"[7137]"]
[]
[null,null,"Retained profits/(accumulated losses) \n    at the beginning of the period (L)",null,null,null,null,null,0,"[7138]",0,"[7139]",0,"[7140]"]
[null,null,"Less: Dividend declared during the period (M)",null,null,null,null,null,0,"[7141]",0,"[7142]",0,"[7143]"]
[]
[]
[null,null,"Retained profits/(accumulated losses) at the end of\n    the period  (N) = (K) + (L) - (M)  (Note 8)",null,null,null,null,null,{"$f":"I123+I125-I126","v":0},"[7144]",{"$f":"K123+K125-K126","v":0},"[7145]",{"$f":"M123+M125-M126","v":0},"[7146]"]
[]
[null,null,"Note 1:","(a)","Transactions denominated in currencies other than Hong Kong dollar should be translated into Hong Kong dollar at the prevailing exchange rates as at the end of the relevant month."]
[]
[null,null,null,"(b)","For the purpose of this form, "]
[null,null,null,null,"-    \"securities dealing\" and \"trading profit and loss in securities\" do not include transactions in stock options\n      contracts;"]
[null,null,null,null,"-    \"futures and options dealing\" and \"trading profit and loss in futures and options contracts\" include transactions in\n      stock options contracts; and"]
[null,null,null,null,"-    Please include relevant gain or loss in virtual assets value that is required by applicable accounting standards to report in profit and loss account (e.g. movements of virtual assets value below cost) in \"trading profit and loss: - in virtual assets\". "]
[]
[null,null,"Note 2:","(a)  ","Please refer to section 41(3) of the Securities and Futures (Financial Resources) Rules for calculation of gross principal value of leveraged foreign exchange contracts. "]
[null,null,null,"(b)  ","Total gross principal value of leveraged foreign exchange contracts includes the gross principal value of contracts for opening and/or closing a leveraged foreign exchange contract during the relevant month. "]
[]
[null,null,"Note 3:","Commission expense includes commission paid to account executives or any other parties."]
[]
[null,null,"Note 4:","For the purpose of this form, any income item exceeding 30% of the total income reported in cell 7093 or any overhead item exceeding 30% of the total overheads reported in cell 7126 should be considered as material."]
[null,null,"Note 5:","Management fees charged on group companies arising from",null,null,null,null,null,null,null,null,"(HK$'000)"]
[null,null,null,"   -  trading profit sharing",null,null,null,null,null,null,null,null,0,"[7146A]"]
[null,null,null,"   -  expenses recharge",null,null,null,null,null,null,null,null,0,"[7146B]"]
[null,null,null,"   -  others (please specify if the item exceeds 30% of the total income reported in cell 7093)",null,null,null,null,null,null,null,null,0,"[7146C]"]
[null,null,null,"",null,null,null,"[7146D]"]
[]
[]
[null,null,null,"Amount included in cell 7084",null,null,null,null,null,null,null,null,{"$f":"M145+M146+M147","v":0},"[7146E]"]
[]
[null,null,"Note 6:","Where gross interest income exceeds 30% of the total income reported in cell 7093 or gross interest expense exceeds 30% of the total overheads reported in cell 7126, please provide details of the interest income and/or interest expense:"]
[]
[null,null,null,"Interest income arising from",null,null,null,null,null,null,null,null,"(HK$'000)"]
[null,null,null,"   -  securities dealing (Note 1b)",null,null,null,null,null,null,null,null,0,"[7147]"]
[null,null,null,"   -  futures and options dealing (Note 1b) ",null,null,null,null,null,null,null,null,0,"[7148]"]
[null,null,null,"   -  leveraged foreign exchange trading ",null,null,null,null,null,null,null,null,0,"[7149]"]
[null,null,null,"   -  securities margin financing",null,null,null,null,null,null,null,null,0,"[7150]"]
[null,null,null,"   -  bank deposits",null,null,null,null,null,null,null,null,0,"[7151]"]
[null,null,null,"   -  securities borrowing and lending and repurchase transactions",null,null,null,null,null,null,null,null,0,"[7151A]"]
[null,null,null,"   -  virtual assets",null,null,null,null,null,null,null,null,0,"[7151B]"]
[null,null,null,"   -  others (please specify if the item exceeds 30% of the total income reported in cell 7093)",null,null,null,null,null,null,null,null,0,"[7152]"]
[null,null,null,"",null,null,null,"[7152A]"]
[]
[]
[null,null,null,"Amounts included in cell 7096",null,null,null,null,null,null,null,null,{"$f":"SUM(M156:M163)","v":0},"[7153]"]
[]
[null,null,null,"Interest expense paid or payable to/on"]
[null,null,null,"   -  clients",null,null,null,null,null,null,null,null,0,"[7154]"]
[null,null,null,"   -  bank loans and overdrafts",null,null,null,null,null,null,null,null,0,"[7155]"]
[null,null,null,"   -  securities borrowing and lending and repurchase transactions",null,null,null,null,null,null,null,null,0,"[7155A]"]
[null,null,null,"   -  others (please specify if the item exceeds 30% of the total overheads reported in cell 7126)",null,null,null,null,null,null,null,null,0,"[7156]"]
[null,null,null,"",null,null,null,"[7156A]"]
[]
[]
[null,null,null,"Amounts included in cell 7099",null,null,null,null,null,null,null,null,{"$f":"SUM(M170:M173)","v":0},"[7157]"]
[]
[null,null,"Note 7:","Management fees charged by group companies arising from",null,null,null,null,null,null,null,null,"(HK$'000)"]
[null,null,null,"   -  trading loss sharing",null,null,null,null,null,null,null,null,0,"[7158]"]
[null,null,null,"   -  expense recharge",null,null,null,null,null,null,null,null,0,"[7159]"]
[null,null,null,"   -  others (please specify if the item exceeds 30% of the total overheads reported in cell 7126)",null,null,null,null,null,null,null,null,0,"[7160]"]
[null,null,null,"",null,null,null,"[7160A]"]
[]
[null,null,null,"Amount included in cell 7120",null,null,null,null,null,null,null,null,{"$f":"SUM(M180:M182)","v":0},"[7161]"]
[]
[]
[null,null,"Note 8:","The amount of retained profits/(accumulated losses) at the end of current month (i.e. cell 7144) should equal to the amount reported under cell 1114 in Form 1 Note 8."]

{"sheet":"Form 8 Table 1","index":11,"n_rows":123,"n_cols":13,"rows_kept":123,"cut":false,"hidden":false,"merged":[[119,4,119,5],[120,4,120,5],[122,4,122,5],[121,4,121,5],[59,4,59,5],[86,3,87,9],[114,4,114,5],[115,4,115,5],[107,4,107,5],[107,6,107,7],[108,4,108,5],[108,6,108,7],[112,4,112,5],[105,4,105,5],[105,6,105,7],[106,4,106,5],[50,3,50,7],[45,3,45,7],[79,3,79,9],[51,3,51,7],[13,3,13,6],[24,3,24,7],[78,3,78,4],[54,3,54,7],[77,3,77,4],[75,3,75,6],[41,6,41,7],[49,4,49,5],[43,6,43,7],[69,8,70,8],[46,3,46,7],[69,3,70,6],[34,4,34,6],[15,3,15,6],[14,3,14,6],[26,3,26,6],[27,3,27,6],[92,6,92,7],[89,4,89,5],[6,8,8,8],[8,2,8,7],[9,3,9,7],[10,3,10,7],[6,2,7,7],[11,3,11,7],[18,3,18,7],[22,2,22,7],[53,3,53,7],[42,6,42,7],[23,3,23,7],[17,3,17,5],[40,6,40,7],[31,4,31,6],[96,4,96,5],[97,4,97,5],[106,6,106,7],[113,4,113,5],[81,4,81,7],[82,4,82,7],[83,4,83,8],[84,4,84,8],[99,4,99,5],[98,4,98,5],[89,6,89,7],[90,4,90,5],[91,4,91,5],[92,4,92,5],[90,6,90,7],[91,6,91,7]]}
[{"$f":"IF(ISBLANK('Form 1 Main'!G14),\"\",\"Financial return of\")&\" \"&IF(ISBLANK('Form 1 Main'!G14),\"\",'Form 1 Main'!G14)","v":"Financial return of "},null,null,null,null,null,null,null,null,{"$f":"IF(ISBLANK(Config!C7),\"\",Config!C7)","v":""}]
[null,"FORM 8",null,"ANALYSIS OF CLIENT ASSETS"]
[]
[null,"Table 1",null,"Analysis of client securities / virtual assets by client type and location "]
[null,null,null,"as of the end of reporting month",null,null,null,null,{"$f":"IF(ISBLANK('Form 1 Main'!L21),\"\",'Form 1 Main'!L21)","v":""},"[1004]"]
[]
[null,null,null,null,null,null,null,null,"Market value\n(HK$'000)"]
[]
[null,null,"Client securities analysis by client type (Note 1)"]
[null,null,null,"Cash clients (A)",null,null,null,null,0,"[8000]"]
[null,null,null,"Margin clients (B)",null,null,null,null,0,"[8001]"]
[null,null,null,"Futures and options clients (C)",null,null,null,null,0,"[8002]"]
[null,null,null,"Leveraged foreign exchange trading clients (D)",null,null,null,null,0,"[8003]"]
[null,null,null,"Clients to whom the licensed corporation provides advising on securities,\n   futures contracts and/or corporate finance services (E) (Note 2a)",null,null,null,null,0,"[8004A]"]
[null,null,null,"Clients to whom the licensed corporation provides asset management services (F) (Note 2b)",null,null,null,null,0,"[8004B]"]
[null,null,null,"Clients to whom the licensed corporation provides automated trading services (G) (Note 2c)",null,null,null,null,0,"[8005B]"]
[null,null,null,"Others (please specify) (H) (Note 2d)",null,null,null,null,0,"[8005C]"]
[null,null,"[8005A]",""]
[null,null,null,"Total (I) = (A) + (B) + (C) + (D) + (E) + (F) + (G) + (H)",null,null,null,null,{"$f":"SUM(I10:I17)","v":0},"[8006]"]
[]
[null,null,"Client virtual assets (including virtual assets which constitutes security)",null,null,null,null,null,0,"[8006A]"]
[]
[null,null,"Client securities analysis by location"]
[null,null,null,"In Hong Kong"]
[null,null,null,"Pledged to authorized financial institutions (J)",null,null,null,null,0,"[8007A]"]
[null,null,null,"Pledged to intermediaries licensed for dealing in securities (K)",null,null,null,null,0,"[8008A]"]
[]
[null,null,null,"Deposited in accounts held in Central Clearing and Settlement System (\"CCASS\")"]
[null,null,null,"   - Stock clearing account (L)",null,null,null,null,0,"[8009]"]
[null,null,null,"   - Stock segregated accounts designated for cash clients (M)",null,null,null,null,0,"[8010]"]
[null,null,null,null,"Please specify the sub-account numbers:"]
[null,null,"[8010A]",null,""]
[null,null,null,"   - Stock segregated accounts designated for margin clients (N)",null,null,null,null,0,"[8011]"]
[null,null,null,null,"Please specify the sub-account numbers:"]
[null,null,"[8011A]",null,""]
[null,null,null,"   - Stock segregated accounts with statement service (O)",null,null,null,null,0,"[8012]"]
[null,null,null,"   - Other accounts (P)",null,null,null,null,0,"[8013]"]
[null,null,null,null,"Please specify sub-account numbers and purposes:"]
[]
[null,null,null,null,"Sub-account number",null,"Purpose"]
[null,null,null,null,null,"[8013A]","",null,"[8013B]"]
[null,null,null,null,null,"[8013C]","",null,"[8013D]"]
[null,null,null,null,null,"[8013E]","",null,"[8013F]"]
[null,null,null,null,null,"[8013G]","",null,"[8013H]"]
[]
[null,null,null,"Total client securities deposited in accounts held in CCASS \n    (Q) = (L) + (M) + (N) + (O) + (P)",null,null,null,null,{"$f":"I29+I30+I33+I36+I37","v":0},"[8014]"]
[null,null,null,"Deposited in accounts maintained with SEOCH (R)  ",null,null,null,null,0,"[8015]"]
[null,null,null,"Held by associated entities (S)",null,null,null,null,0,"[8017]"]
[null,null,null,"       -  Please specify names of the associated entities:"]
[null,null,"[8017A]",null,""]
[null,null,null,"Deposited in safe custody in accounts maintained with authorized financial institutions (T)",null,null,null,null,0,"[8018]"]
[null,null,null,"Deposited in safe custody in accounts maintained with other licensed corporations (U)",null,null,null,null,0,"[8019]"]
[null,null,null,"Held in the office premises of the licensed corporation (V)",null,null,null,null,0,"[8020]"]
[null,null,null,"Held in other locations or for other purposes (W) (Note 3) ",null,null,null,null,0,"[8021A]"]
[null,null,null,"Total client securities held in Hong Kong\n    (X) = (J) + (K) + (Q) + (R) + (S) + (T) + (U) + (V) + (W)",null,null,null,null,{"$f":"I25+I26+I46+I47+I51+I48+I52+I53+I54","v":0},"[8021B]"]
[]
[null,null,"Client virtual assets analysis by location"]
[null,null,null,"Held by associated entities / other licensed providers (Note 5)",null,null,null,null,0,"[8021BA]"]
[null,null,null,"       -  Please specify all the names of the associated entities / licensed providers:"]
[null,null,"[8021BB]",null,""]
[]
[null,null,null,"Outside Hong Kong"]
[null,null,null," Pledged to overseas banks (Y)",null,null,null,null,0,"[8007B]"]
[null,null,null," Pledged to overseas securities dealers (Z)",null,null,null,null,0,"[8008]"]
[]
[null,null,null," Deposited in accounts maintained with overseas clearing houses (AA)",null,null,null,null,0,"[8021C]"]
[null,null,null," Deposited in safe custody in accounts maintained with overseas banks (AB)",null,null,null,null,0,"[8021D]"]
[null,null,null," Deposited in safe custody in accounts maintained with overseas securities or futures dealers (AC)",null,null,null,null,0,"[8021E]"]
[null,null,null," Held in other locations or for other purposes (AD) (Note 3)",null,null,null,null,0,"[8021F]"]
[null,null,null," Total client securities held outside Hong Kong \n  (AE) = (Y) + (Z) + (AA) + (AB) + (AC) + (AD)",null,null,null,null,{"$f":"SUM(I63:I69)","v":0}]
[null,null,null,null,null,null,null,null,null,"[8021G]"]
[]
[null,null,null,"Total client securities = (X) + (AE) (Note 4)",null,null,null,null,{"$f":"_ACA1019+_ACA1056","v":0},"[8022]"]
[]
[]
[null,null,"Note 1:","Client securities / virtual assets are accounted for on:"]
[null,null,null,null,"(select where appropriate)"]
[]
[null,null,null,null,null,null,null,null,null,null,null,null,""]
[]
[]
[null,null,"Note 2:","(a)","Excluding client securities already reported in cells 8000, 8001, 8002 and 8003."]
[null,null,null,"(b)","Excluding client securities already reported in cells 8000, 8001, 8002, 8003 and 8004A."]
[null,null,null,"(c)","Excluding client securities already reported in cells 8000, 8001, 8002, 8003, 8004A and 8004B."]
[null,null,null,"(d)","Excluding client securities already reported in cells 8000, 8001, 8002, 8003, 8004A, 8004B and 8005B."]
[]
[null,null,"Note 3:","Top 3 locations where the largest amount of client securities (in terms of market value) was held in other locations or for other purposes"]
[]
[null,null,null,"In Hong Kong"]
[null,null,"Row","Ranking","Name of bank / broker / counterparty / custodian",null,"Purpose ",null,"Market value of client securities held\n(HK$'000)",null,"Row"]
[null,null,"[1]",1,"",null,null,null,0,"[8026]","[1]"]
[null,null,"[2]",2,"",null,null,null,0,"[8027]","[2]"]
[null,null,"[3]",3,"",null,null,null,0,"[8028]","[3]"]
[]
[]
[null,null,null,"Outside Hong Kong"]
[null,null,null,"Ranking","Name of bank / broker / counterparty / custodian",null,"Geographical location","Purpose ","Market value of client securities held\n(HK$'000)"]
[null,null,"[4]",1,"",null,null,null,0,"[8029]","[4]"]
[null,null,"[5]",2,"",null,null,null,0,"[8030]","[5]"]
[null,null,"[6]",3,"",null,null,null,0,"[8031]","[6]"]
[]
[]
[null,null,"Note 4:","Top 3 affiliated counterparties or custodians holding the largest amount of client securities (in terms of market value)"]
[]
[null,null,null,"In Hong Kong"]
[null,null,null,"Ranking","Name of affiliated counterparty / custodian",null,"Purpose ",null,"Market value of client securities held\n(HK$'000)"]
[null,null,"[7]",1,"",null,null,null,0,"[8032]","[7]"]
[null,null,"[8]",2,"",null,null,null,0,"[8033]","[8]"]
[null,null,"[9]",3,"",null,null,null,0,"[8034]","[9]"]
[]
[]
[null,null,null,"Outside Hong Kong"]
[null,null,null,"Ranking","Name of affiliated counterparty / custodian",null,"Geographical location","Purpose ","Market value of client securities held\n(HK$'000)"]
[null,null,"[10]",1,"",null,null,null,0,"[8035]","[10]"]
[null,null,"[11]",2,"",null,null,null,0,"[8036]","[11]"]
[null,null,"[12]",3,"",null,null,null,0,"[8037]","[12]"]
[]
[null,null,"Note 5:","Top 3 locations where the largest amount of client virtual assets (in terms of market value) was held by associated entities / other licensed providers"]
[]
[null,null,null,"Ranking","Name of counterparty",null,"Geographical location","Purpose ","Market value of client virtual assets held\n(HK$'000)"]
[null,null,"[13]",1,"",null,null,null,0,"[8038]","[13]"]
[null,null,"[14]",2,"",null,null,null,0,"[8039]","[14]"]
[null,null,"[15]",3,"",null,null,null,0,"[8040]","[15]"]

{"sheet":"Form 8 Table 2","index":12,"n_rows":82,"n_cols":13,"rows_kept":82,"cut":false,"hidden":false,"merged":[[36,2,37,6],[31,3,31,6],[36,11,37,11],[70,2,73,2],[17,11,20,11],[23,11,24,11],[25,11,26,11],[31,11,34,11],[17,8,20,8],[23,8,24,8],[27,8,28,8],[29,8,30,8],[70,3,73,10],[36,9,37,9],[36,10,37,10],[67,3,67,10],[38,8,39,8],[4,8,4,9],[38,9,39,9],[23,10,24,10],[25,10,26,10],[38,10,39,10],[27,9,28,9],[29,9,30,9],[17,9,20,9],[17,10,20,10],[31,9,34,9],[31,10,34,10],[23,9,24,9],[22,2,22,8],[27,3,28,7],[29,3,30,6],[31,8,34,8],[16,3,16,7],[25,3,26,7],[38,2,38,7],[66,3,66,10],[41,3,41,10],[43,3,43,10],[45,3,45,10],[25,9,26,9],[18,3,20,6],[32,3,34,6],[23,3,24,7],[32,2,34,2],[47,3,47,10],[48,4,48,8],[49,4,49,8],[63,4,63,5],[63,6,63,8],[50,4,50,8],[58,6,58,8],[58,4,58,5],[51,4,51,8],[52,4,52,8],[53,4,53,8],[55,3,55,10],[57,3,57,10],[60,4,60,5],[60,6,60,8],[61,4,61,5],[61,6,61,8],[62,4,62,5],[62,6,62,8],[44,3,44,10],[81,4,81,5],[76,7,76,8],[77,7,77,8],[78,7,78,8],[79,7,79,8],[80,7,80,8],[81,7,81,8],[78,4,78,5],[79,4,79,5],[80,4,80,5],[76,4,76,5],[77,4,77,5],[75,3,75,10],[59,6,59,8],[59,4,59,5]]}
[{"$f":"IF(ISBLANK('Form 1 Main'!G14),\"\",\"Financial return of\")&\" \"&IF(ISBLANK('Form 1 Main'!G14),\"\",'Form 1 Main'!G14)","v":"Financial return of "},null,null,null,null,null,null,null,null,null,null,{"$f":"IF(ISBLANK(Config!C7),\"\",Config!C7)","v":""}]
[null,"FORM 8  ",null,"ANALYSIS OF CLIENT ASSETS"]
[]
[null,"Table 2",null,"Analysis of client segregated funds"]
[null,null,null,"as of the end of reporting month",null,null,null,null,{"$f":"IF(ISBLANK('Form 1 Main'!L21),\"\",'Form 1 Main'!L21)","v":""},null,"[1004]"]
[null,"(Note: licensed corporation which is also a licensed provider is required to report client segregated funds held by its associated entity in this form)"]
[]
[null,null,null,null,null,null,null,null,null,"Computation of","Analysis of client"]
[null,null,null,null,null,null,null,null,null,"ranking liabilities","segregated funds"]
[null,null,null,null,null,null,null,null,null,"(HK$'000)","(HK$'000)"]
[null,null,null,null,null,null,null,null,null,"(Note 1)","(Note 2)"]
[null,null,"Amounts payable to clients and client money to be segregated",null,null,null,null,null,null,"Amounts payable to clients","Client money to be segregated under the Securities and Futures (Client Money) Rules"]
[null,null,null,"Cash clients",null,null,null,null,"[8100]",0,0,"[8101]"]
[null,null,null,"Margin clients",null,null,null,null,"[8102]",0,0,"[8103]"]
[null,null,null,"Futures and options clients",null,null,null,null,"[8104]",0,0,"[8105]"]
[null,null,null,"Leveraged foreign exchange trading clients",null,null,null,null,"[8106]",0,0,"[8107]"]
[null,null,null,"Clients to whom the licensed corporation provides\n    advising on securities, futures contracts and/or \n    corporate finance, and/or asset management\n    services",null,null,null,null,"[8108]",0,0,"[8109]"]
[null,null,null,"Others (please specify)",null,null,null,null,"[8110]",0,0,"[8111]"]
[null,null,null,""]
[]
[null,null,"[8110A]"]
[null,null,null,"Total (Note 3)",null,null,null,null,"[8112]",{"$f":"SUM(J13:J21)","v":0},{"$f":"SUM(K13:K21)","v":0},"[8113]"]
[null,null,"Distribution of segregated funds"]
[null,null,null,"Amounts held in segregated account maintained \n    with authorized financial institutions (Note 4)",null,null,null,null,"[8114]",0,0,"[8115]"]
[]
[null,null,null,"Amounts held in segregated account maintained\n    with other persons approved by the Commission\n    under the Securities and Futures (Client Money) \n    Rules (Note 4)",null,null,null,null,null,0,0,"[8117]"]
[null,null,null,null,null,null,null,null,"[8116]"]
[null,null,null,"Amounts held in segregated account maintained with \n    approved banks incorporated outside Hong Kong  \n    (Note 5)",null,null,null,null,"[8118]",0]
[]
[null,null,null,"Amounts held in segregated account maintained with \n    recognized clearing houses",null,null,null,null,"[8119]",0]
[]
[null,null,null,"Others (including amounts which are held in a \n   segregated account and included in liquid assets \n   under section 20(d) of the Securities and Futures  \n   (Financial Resources) Rules (to be reported herein \n   as a deduction) and amounts which arise from\n   modifications) (please specify)",null,null,null,null,"[8120]",0,0,"[8121]"]
[null,null,"[8120A]",""]
[]
[]
[null,null,null,"Total ",null,null,null,null,"[8122]",{"$f":"SUM(J24:J35)","v":0},{"$f":"SUM(K24:K35)","v":0},"[8123]"]
[null,null,"Excess/(deficiency) in segregated funds \n(cell 8123 – cell 8113) (Note 6)",null,null,null,null,null,null,null,{"$f":"K36-K22","v":0},"[8124]"]
[]
[null,null,"Amount to be included in ranking liabilities under item 23 of liquid capital computation (cell 8112 – cell 8122) (Notes 6 & 7)",null,null,null,null,null,"[8125]",{"$f":"IF(J22-J36>0,J22-J36,0)","v":0}]
[]
[]
[null,null,"Note 1:","Computation of ranking liabilities is for the purpose of calculating the amounts (which should not be less than zero) to be included in item 23 of liquid capital computation in Form 1 (i.e. cell 1057)."]
[]
[null,null,"Note 2: ","Analysis of client segregated funds is for the purpose of reconciling the total amount of client money required to be segregated in accordance with the Securities and Futures (Client Money) Rules with the corresponding amounts held in segregated accounts.\n\n"]
[null,null,null,"For the purpose of this analysis, a segregated account refers to an account that is referred to in paragraph (a) of the definition of \"segregated account\" in section 2(1) of the Securities and Futures (Financial Resources) Rules."]
[null,null,"Note 3:","Total amount payable to clients included in cell 8112 should be equal to the amounts payable to clients included in item 23 of the balance sheet in Form 1 (i.e. cell 1058). "]
[]
[null,null,"Note 4:","(a) A segregated account referred to in these items means an account specified in paragraph (a) of the definition of\n     \"segregated account\" in section 2(1) of the Securities and Futures (Financial Resources) Rules.\n\n(b) Top 5 authorized financial institutions and other persons approved by the Commission under the Securities and Futures\n     (Client Money) Rules holding the largest aggregate amount of client money in segregated accounts (Note 4a)"]
[null,null,"Row","Ranking","Name of authorized financial institution / other persons approved by the Commission under the Securities and Futures (Client Money) Rules ",null,null,null,null,"Is it an affiliate of the licensed corporation?","Amount of client money held\n(HK$'000)",null,"Row"]
[null,null,"[1]",1,"",null,null,null,null,null,0,"[8125A]","[1]"]
[null,null,"[2]",2,"",null,null,null,null,null,0,"[8125B]","[2]"]
[null,null,"[3]",3,"",null,null,null,null,null,0,"[8125C]","[3]"]
[null,null,"[4]",4,"",null,null,null,null,null,0,"[8125D]","[4]"]
[null,null,"[5]",5,"",null,null,null,null,null,0,"[8125E]","[5]"]
[]
[null,null,"Note 5:","(a) A segregated account referred to in this item means an account specified in paragraph (a) or (b) of the definition of \n     \"segregated account\" in section 2(1) of the Securities and Futures (Financial Resources) Rules."]
[]
[null,null,null,"(b) Top 5 approved banks incorporated outside Hong Kong holding the largest aggregate amount of client money in\n      segregated accounts (Note 5a)"]
[null,null,null,"Ranking","Name of approved bank",null,"Geographical location",null,null,"Is it an affiliate of the licensed corporation?","Amount of client money held\n(HK$'000)"]
[null,null,"[6]",1,"",null,null,null,null,null,0,"[8125F]","[6]"]
[null,null,"[7]",2,"",null,null,null,null,null,0,"[8125G]","[7]"]
[null,null,"[8]",3,"",null,null,null,null,null,0,"[8125H]","[8]"]
[null,null,"[9]",4,"",null,null,null,null,null,0,"[8125I]","[9]"]
[null,null,"[10]",5,"",null,null,null,null,null,0,"[8125J]","[10]"]
[]
[null,null,"Note 6:","Please explain in the space below the circumstances leading to:"]
[null,null,null,"(a)  total segregated funds for the purpose of calculating ranking liabilities exceeding total amount payable to clients\n       (i.e. cell 8122 > cell 8112); "]
[null,null,null,"(b)  difference between ranking liabilities computed in cell 8125 and amount of ranking liabilities included in item 23 of \n       Form 1 (i.e. cell 1057); and/or"]
[null,null,null,"(c)  excess or deficiency in segregated funds."]
[]
[null,null,"[8126]",""]
[]
[]
[]
[]
[null,null,"Note 7:","Top 5 overseas counterparties other than approved banks incorporated outside Hong Kong holding the largest aggregate amount of client money"]
[null,null,null,"Ranking","Name of counterparty",null,"Type of counterparty","Geographical location ",null,"Is it an affiliate of the licensed corporation?","Amount of client money held\n(HK$'000)"]
[null,null,"[11]",1,"",null,null,null,null,null,0,"[8127]","[11]"]
[null,null,"[12]",2,"",null,null,null,null,null,0,"[8128]","[12]"]
[null,null,"[13]",3,"",null,null,null,null,null,0,"[8129]","[13]"]
[null,null,"[14]",4,"",null,null,null,null,null,0,"[8130]","[14]"]
[null,null,"[15]",5,"",null,null,null,null,null,0,"[8131]","[15]"]

{"sheet":"Form 9","index":13,"n_rows":44,"n_cols":14,"rows_kept":44,"cut":false,"hidden":false,"merged":[[41,3,41,12],[43,3,43,12],[6,2,6,3],[5,4,5,9],[6,4,6,9],[7,8,10,8],[42,3,42,13],[7,2,14,2],[5,10,5,11],[5,12,8,12],[7,6,8,7],[9,6,11,6],[9,7,11,7],[7,10,11,10],[7,11,11,11],[5,2,5,3]]}
[{"$f":"IF(ISBLANK('Form 1 Main'!G14),\"\",\"Financial return of\")&\" \"&IF(ISBLANK('Form 1 Main'!G14),\"\",'Form 1 Main'!G14)","v":"Financial return of "},null,null,null,null,null,null,null,null,null,null,null,null,{"$f":"IF(ISBLANK(Config!C7),\"\",Config!C7)","v":""}]
[null,"FORM 9",null,"FOREIGN CURRENCY POSITION OF LICENSED CORPORATION LICENSED FOR LEVERAGED FOREIGN EXCHANGE TRADING"]
[null,null,null,"AS OF THE END OF REPORTING MONTH",null,null,null,null,{"$f":"IF(ISBLANK('Form 1 Main'!L21),\"\",'Form 1 Main'!L21)","v":""},"[1004]"]
[]
[]
[null,null,"Currency (Note 1)",null,"Foreign currency position including position held with recognized counterparty",null,null,null,null,null,"Position with recognized counterparty",null,"Aggregate gross foreign currency position"]
[]
[null,null,"Currency code","Type","Assets","Liabilities","Outstanding contracts (including spot contracts)",null,"Gross foreign currency position\n(Note 2) ","Net position","Assets & amounts of foreign currency in which the licensed corporation is exposed to the risk of a decline in the value of the foreign currency under outstanding contracts (including spot contracts)","Liabilities & amounts of foreign currency in which the licensed corporation is exposed to the risk of a rise in the value of the foreign currency under outstanding contracts (including spot contracts)"]
[]
[null,null,null,null,null,null,"Amounts of foreign currency in which the licensed corporation is exposed to the risk of a decline in the value of the foreign currency \n","Amounts of foreign currency in which the licensed corporation is exposed to the risk of a rise in the value of the foreign currency "]
[]
[null,null,null,null,"\n"]
[null,null,null,null,"(A)","(B)","(C)","(D)","(E)","  (F) = (A) + (C) -  (B) - (D)","(G)","(H)","(I) = (E) - (G) - (H)"]
[]
[null,"Row",null,null,"(HK$'000)","(HK$'000)","(HK$'000)","(HK$'000)","(HK$'000)","(HK$'000)","(HK$'000)","(HK$'000)","(HK$'000)","Row"]
[null,"[1]","","",0,0,0,0,0,{"$f":"E16+G16-F16-H16","v":0},0,0,{"$f":"I16-K16-L16","v":0},"[1]"]
[null,"[2]","","",0,0,0,0,0,{"$f":"E17+G17-F17-H17","v":0},0,0,{"$f":"I17-K17-L17","v":0},"[2]"]
[null,"[3]","","",0,0,0,0,0,0,0,0,0,"[3]"]
[null,"[4]","","",0,0,0,0,0,0,0,0,0,"[4]"]
[null,"[5]","","",0,0,0,0,0,0,0,0,0,"[5]"]
[null,"[6]","","",0,0,0,0,0,0,0,0,0,"[6]"]
[null,"[7]","","",0,0,0,0,0,0,0,0,0,"[7]"]
[null,"[8]","","",0,0,0,0,0,0,0,0,0,"[8]"]
[null,"[9]","","",0,0,0,0,0,0,0,0,0,"[9]"]
[null,"[10]","","",0,0,0,0,0,0,0,0,0,"[10]"]
[null,"[11]","","",0,0,0,0,0,0,0,0,0,"[11]"]
[null,"[12]","","",0,0,0,0,0,0,0,0,0,"[12]"]
[null,"[13]","","",0,0,0,0,0,0,0,0,0,"[13]"]
[null,"[14]","","",0,0,0,0,0,0,0,0,0,"[14]"]
[null,"[15]","","",0,0,0,0,0,0,0,0,0,"[15]"]
[null,"[16]","","",0,0,0,0,0,0,0,0,0,"[16]"]
[null,"[17]","","",0,0,0,0,0,0,0,0,0,"[17]"]
[null,"[18]","","",0,0,0,0,0,0,0,0,0,"[18]"]
[null,"[19]","","",0,0,0,0,0,0,0,0,0,"[19]"]
[null,"[20]","","",0,0,0,0,0,0,0,0,0,"[20]"]
[null,null,"Total",null,{"$f":"SUM(E16:E35)","v":0},0,0,0,0,{"$f":"ABS(J16)+ABS(J17)+ABS(J18)+ABS(J19)+ABS(J20)+ABS(J21)+ABS(J22)+ABS(J23)+ABS(J24)+ABS(J25)+ABS(J26)+ABS(J27)+ABS(J28)+ABS(J29)+ABS(J30)+ABS(J31)+ABS(J32)+ABS(J33)+ABS(J34)+ABS(J35)","v":0},0,0,{"$f":"ABS(M16)+ABS(M17)+ABS(M18)+ABS(M19)+ABS(M20)+ABS(M21)+ABS(M22)+ABS(M23)+ABS(M24)+ABS(M25)+ABS(M26)+ABS(M27)+ABS(M28)+ABS(M29)+ABS(M30)+ABS(M31)+ABS(M32)+ABS(M33)+ABS(M34)+ABS(M35)","v":0}]
[null,null,null,null,null,null,null,null,null,null,null,"Multiplied by","1.5%"]
[null,null,null,null,null,null,null,null,null,null,null,"Amounts included in required liquid capital computation in cell 2011",{"$f":"ROUND(M36*0.015,0)","v":0},"[9000]"]
[]
[]
[]
[null,null,"Note 1:  ","Licensed corporation should select the currency code from the pull-down menu. If type of the currency is not available from the pull-down menu,\nplease select currency code \"099\" and specify the type of the currency in the space provided.  "]
[]
[null,null,"Note 2:  ","Please refer to section 2A of the Securities and Futures (Financial Resources) Rules for the definition of gross foreign currency position and the\ntreatment of a pair of outstanding contracts which the licensed corporation holds with a client (except a client whose account with the licensed \ncorporation is an omnibus account) referred to in subsection (3) of the above section."]

{"sheet":"Form 10 Table 1","index":14,"n_rows":48,"n_cols":12,"rows_kept":48,"cut":false,"hidden":false,"merged":[[36,2,38,10],[1,7,1,8],[35,2,35,10],[6,4,6,10],[48,2,48,3],[39,2,39,10],[40,2,40,10],[47,2,47,10],[42,2,45,10]]}
[{"$f":"IF(ISBLANK('Form 1 Main'!G14),\"\",\"Financial return of\")&\" \"&IF(ISBLANK('Form 1 Main'!G14),\"\",'Form 1 Main'!G14)","v":"Financial return of "},null,null,null,null,null,null,null,null,null,null,{"$f":"IF(ISBLANK(Config!C7),\"\",Config!C7)","v":""}]
[null,"FORM 10","REPORT ON PROPRIETARY DERIVATIVE POSITIONS (Notes 1 & 2)"]
[]
[null,"Table 1","Analysis of gross notional amounts of derivative contracts by underlying exposures"]
[null,null,"as of the end of reporting month              ",null,null,{"$f":"IF(ISBLANK('Form 1 Main'!L21),\"\",'Form 1 Main'!L21)","v":""},"[1004]"]
[]
[null,null,null,null,"(HK$'000)"]
[null,null,"Gross notional amounts",null,"Equity contracts (Note 3)","Interest rate \ncontracts","Foreign exchange\ncontracts","Precious metals\ncontracts","Other commodity\ncontracts","Virtual assets contracts","\nTotal"]
[null,null,"OTC contracts","Row",null,null,null,null,null,null,null,"Row"]
[null,null,"Forwards","[1]",0,0,0,0,0,0,{"$f":"SUM(E10:J10)","v":0},"[1]"]
[null,null,"Swaps","[2]",0,0,0,0,0,0,{"$f":"SUM(E11:J11)","v":0},"[2]"]
[null,null,"Purchased options","[3]",0,0,0,0,0,0,0,"[3]"]
[null,null,"Written options","[4]",0,0,0,0,0,0,0,"[4]"]
[null,null,"Others (please specify)","[5]",0,0,0,0,0,0,0,"[5]"]
[]
[null,"[A100]",""]
[]
[null,null,"Total OTC contracts","[6]",{"$f":"SUM(E10:E14)","v":0},0,0,0,0,0,0,"[6]"]
[null,null,"Exchange-traded contracts"]
[null,null,"Futures - long positions","[7]",0,0,0,0,0,0,{"$f":"SUM(E20:J20)","v":0},"[7]"]
[null,null,"Futures - short positions","[8]",0,0,0,0,0,0,{"$f":"SUM(E21:J21)","v":0},"[8]"]
[null,null,"Purchased unlisted options","[9A]",0,0,0,0,0,0,0,"[9A]"]
[null,null,"Purchased listed options","[9B]",0,0,0,0,0,0,0,"[9B]"]
[null,null,"Written unlisted options","[10A]",0,0,0,0,0,0,0,"[10A]"]
[null,null,"Purchased listed options","[11]",0,0,0,0,0,null,0,"[11]"]
[null,null,"Written listed options","[12]",0,0,0,0,0,null,0,"[12]"]
[null,null,"Written listed options","[10B]",0,0,0,0,0,0,0,"[10B]"]
[null,null,"Others (please specify)","[11]",0,0,0,0,0,0,0,"[11]"]
[]
[null,"[A101]",""]
[]
[null,null,"Total exchange-traded contracts","[12]",{"$f":"SUM(E20:E28)","v":0},0,0,0,0,0,0,"[12]"]
[null,null,"Total OTC and exchange-traded contracts","[13]",{"$f":"E18+E32","v":0},{"$f":"F18+F32","v":0},{"$f":"G18+G32","v":0},{"$f":"H18+H32","v":0},{"$f":"I18+I32","v":0},{"$f":"J18+J32","v":0},0,"[13]"]
[null,null,null,null,"[A102]","[A103]","[A104]","[A105]","[A106]","[A106A]","[A107]"]
[null,"Note 1:","This form should be reported on quarterly basis, i.e. for March, June, September and December only."]
[null,"Note 2:","Please describe the licensed corporation's proprietary derivative trading activities under each broad category of exposures (i.e. equity, interest rate etc.) in the following space, covering at least the following information:"]
[null,null,"(a)  the nature, objective and operation of the trading strategies which underlie each trading positions/portfolios (for instance, for equities, whether equity\n       derivative trading is related to arbitrage or hedging of derivative warrants or equity swaps; the types of derivative instruments used and details of other\n       positions involved in the strategies);"]
[]
[]
[null,null,"(b)  the major income and cost arising from the derivative trading (for instance, trading profits/losses, commissions, fees etc.); and"]
[null,null,"(c)  the future plan for the derivative trading business."]
[]
[null,null,""]
[]
[]
[null,"[A108]"]
[]
[null,"Note 3:","For the purpose of this table, derivative warrants listed on an exchange are classified as exchange-traded listed options and convertible bonds are classified as OTC equity derivatives.  Equity contracts include equity index contracts."]

{"sheet":"Form 10 Table 2","index":15,"n_rows":28,"n_cols":12,"rows_kept":28,"cut":false,"hidden":false,"merged":[[12,9,13,9],[14,9,15,9],[12,4,13,4],[4,6,4,7],[12,7,13,7],[12,8,13,8],[6,4,6,10],[7,10,10,10],[14,10,15,10],[12,10,13,10],[14,4,15,4],[7,9,10,9],[12,6,13,6],[14,8,15,8],[7,6,10,6],[14,6,15,6],[7,8,10,8],[14,7,15,7],[7,7,10,7],[12,3,13,3],[14,3,15,3],[7,3,10,3],[12,5,13,5],[14,5,15,5],[7,4,10,4],[7,5,10,5],[27,3,28,10],[17,7,20,7],[17,3,20,3],[17,8,20,8],[17,10,20,10],[25,3,25,10],[17,4,20,4],[17,5,20,5],[17,6,20,6],[17,9,20,9]]}
[{"$f":"IF(ISBLANK('Form 1 Main'!G14),\"\",\"Financial return of\")&\" \"&IF(ISBLANK('Form 1 Main'!G14),\"\",'Form 1 Main'!G14)","v":"Financial return of "},null,null,null,null,null,null,null,null,null,null,{"$f":"IF(ISBLANK(Config!C7),\"\",Config!C7)","v":""}]
[null,"FORM 10",null,"REPORT ON PROPRIETARY DERIVATIVE POSITIONS"]
[]
[null,"Table 2",null,"Analysis of derivative contracts by market value and unrealized value"]
[null,null,null,"as of the end of reporting month",null,null,{"$f":"IF(ISBLANK('Form 1 Main'!L21),\"\",'Form 1 Main'!L21)","v":""},null,"[1004]"]
[]
[null,null,null,null,"(HK$'000)"]
[null,null,null,"Market values (Note 1)","Equity contracts\n","Interest rate contracts\n","Foreign exchange contracts\n","Precious metals contracts\n","Other commodity contracts\n","Virtual assets contracts\n","Total\n"]
[]
[]
[]
[null,null,"OTC contracts",null,"[A200]","[A201]","[A202]","[A203]","[A204]","[A204A]","[A205]"]
[null,null,null,"(a) Gross positive market value (Note 2)",0,0,0,0,0,0,{"$f":"SUM(E13:J14)","v":0}]
[]
[null,null,null,"(b) Gross negative market value",0,0,0,0,0,0,{"$f":"SUM(E15:J16)","v":0}]
[]
[null,null,null,null,"[A206]","[A207]","[A208]","[A209]","[A210]","[A210A]","[A211]"]
[null,null,null,"Unrealized values","Equity contracts\n","Interest rate contracts\n","Foreign exchange contracts\n","Precious metals contracts\n","Other commodity contracts\n","Virtual assets contracts\n","Total\n"]
[]
[]
[]
[null,null,"Exchange-traded contracts",null,"[A212]","[A213]","[A214]","[A215]","[A216]","[A216A]","[A217]"]
[null,null,null,"(c) Gross unrealized gains",0,0,0,0,0,0,{"$f":"SUM(E23:J23)","v":0}]
[null,null,null,"(d) Gross unrealized losses",0,0,0,0,0,0,{"$f":"SUM(E24:J24)","v":0}]
[null,null,null,null,"[A218]","[A219]","[A220]","[A221]","[A222]","[A222A]","[A223]"]
[null,null,"Note 1:","The market value of an OTC derivative contract is the amount at which a contract could be exchanged in a current transaction between willing parties, other than in a forced or liquidation sale.  If a quoted market price is not available, the licensed corporation's best estimate of market value could be used, based on the quoted market price of a similar contract or on its valuation techniques (i.e. fair value)."]
[]
[null,null,"Note 2:","Gross positive market value represents the loss that a licensed corporation would incur in the event of a counterparty default, as measured by the cost of replacing the contract at current market price or rate.  For instance, for an OTC forward and swap contract, its positive market value means the unrealized gain calculated on the valuation date.  For a long position in OTC options contract, its positive market value is the market price or fair value of the options (this measure does not take into account any reduction in credit exposure that would occur under legally enforceable netting arrangements)."]

{"sheet":"Form 10 Table 3","index":16,"n_rows":21,"n_cols":15,"rows_kept":21,"cut":false,"hidden":false,"merged":[[18,5,18,6],[4,6,4,7],[13,2,14,3],[13,4,14,4],[9,2,10,3],[6,5,6,12],[9,11,10,12],[9,5,10,6],[9,7,10,8],[9,9,10,10],[11,5,11,6],[11,7,11,8],[12,5,12,6],[12,7,12,8],[17,5,17,6],[17,7,17,8],[13,13,14,13],[11,11,11,12],[18,7,18,8],[18,9,18,10],[18,11,18,12],[16,7,16,8],[16,9,16,10],[17,9,17,10],[17,11,17,12],[13,14,14,14],[11,9,11,10],[12,9,12,10],[22,3,22,12],[12,11,12,12],[16,11,16,12],[13,5,14,6],[13,7,14,8],[13,9,14,10],[13,11,14,12],[15,7,15,8],[15,9,15,10],[15,11,15,12],[16,5,16,6],[20,3,21,12],[15,5,15,6]]}
[{"$f":"IF(ISBLANK('Form 1 Main'!G14),\"\",\"Financial return of\")&\" \"&IF(ISBLANK('Form 1 Main'!G14),\"\",'Form 1 Main'!G14)","v":"Financial return of "},null,null,null,null,null,null,null,null,null,null,null,null,null,{"$f":"IF(ISBLANK(Config!C7),\"\",Config!C7)","v":""}]
[null,"FORM 10",null,"REPORT ON PROPRIETARY DERIVATIVE POSITIONS"]
[]
[null,"Table 3",null,"Analysis of OTC derivative contracts by remaining term to maturity"]
[null,null,null,"as of the end of reporting month",null,null,{"$f":"IF(ISBLANK('Form 1 Main'!L21),\"\",'Form 1 Main'!L21)","v":""},null,"[1004]"]
[]
[null,null,null,null,null,"(HK$'000)"]
[]
[]
[null,null,"Gross notional amounts by OTC contracts\n(Note 1)",null,null,"1 year or less\n",null,"Over 1 year through 5 years\n",null,"Over 5 years\n",null,"Total\n"]
[null,null,null,null,"Row",null,null,null,null,null,null,null,null,null,"Row"]
[null,null,"(a) Equity contracts",null,"[1]",0,null,0,null,0,null,{"$f":"SUM(F12:K12)","v":0},null,"[A300]","[1]"]
[null,null,"(b) Interest rate contracts",null,"[2]",0,null,0,null,0,null,{"$f":"SUM(F13:K13)","v":0},null,"[A301]","[2]"]
[null,null,"(c) Foreign exchange contracts",null,"[3]",0,null,0,null,0,null,{"$f":"SUM(F14:K15)","v":0},null,"[A302]","[3]"]
[]
[null,null,"(d) Precious metals contracts",null,"[4]",0,null,0,null,0,null,{"$f":"SUM(F16:K16)","v":0},null,"[A303]","[4]"]
[null,null,"(e) Other commodity contracts",null,"[5]",0,null,0,null,0,null,{"$f":"SUM(F17:K17)","v":0},null,"[A304]","[5]"]
[null,null,"(f) Virtual assets contracts",null,"[6]",0,null,0,null,0,null,{"$f":"SUM(F18:K18)","v":0},null,"[A305]","[6]"]
[]
[]
[null,null,"Note 1: ","The information in this table is based on the remaining term to maturity of the derivative contract."]

{"sheet":"Form 10 Table 4","index":17,"n_rows":30,"n_cols":15,"rows_kept":30,"cut":false,"hidden":false,"merged":[[6,4,6,13],[9,4,10,7],[14,12,14,13],[15,12,15,13],[9,10,12,11],[9,12,12,13],[15,10,15,11],[13,12,13,13],[17,4,17,5],[17,6,17,7],[17,8,17,9],[17,10,17,11],[11,4,12,5],[11,6,12,7],[15,4,15,5],[13,6,13,7],[13,8,13,9],[14,8,14,9],[16,4,16,5],[14,10,14,11],[15,8,15,9],[13,10,13,11],[14,6,14,7],[4,7,4,8],[29,3,29,13],[26,3,27,13],[16,6,16,7],[16,8,16,9],[16,10,16,11],[16,12,16,13],[20,3,21,13],[22,3,23,13],[24,3,25,13],[9,2,11,3],[15,6,15,7],[13,4,13,5],[14,4,14,5],[17,12,17,13],[9,8,12,9]]}
[{"$f":"IF(ISBLANK('Form 1 Main'!G14),\"\",\"Financial return of\")&\" \"&IF(ISBLANK('Form 1 Main'!G14),\"\",'Form 1 Main'!G14)","v":"Financial return of "},null,null,null,null,null,null,null,null,null,null,null,null,null,{"$f":"IF(ISBLANK(Config!C7),\"\",Config!C7)","v":""}]
[null,"FORM 10",null,"REPORT ON PROPRIETARY DERIVATIVE POSITIONS"]
[]
[null,"Table 4",null,"Analysis of OTC derivative contracts by credit quality"]
[null,null,null,"as of the end of reporting month",null,null,null,{"$f":"IF(ISBLANK('Form 1 Main'!L21),\"\",'Form 1 Main'!L21)","v":""},null,"[1004]"]
[]
[null,null,null,null,"(HK$'000)"]
[]
[]
[null,null,"Counterparty credit quality (Note 1)",null,"Exposure before collateral and guarantees",null,null,null,"Aggregate of collateral\n",null,"Aggregate amount of guarantees\n",null,"Credit equivalent amount after collateral and guarantees\n"]
[]
[null,null,null,null,"Aggregate gross positive market value\n",null,"Aggregate of current credit exposure (Note 2)\n"]
[null,null,null,"Row",null,null,null,null,null,null,null,null,null,null,"Row"]
[null,null,1,"[1]",0,null,0,null,0,null,0,null,0,null,"[1]"]
[null,null,2,"[2]",0,null,0,null,0,null,0,null,0,null,"[2]"]
[null,null,3,"[3]",0,null,0,null,0,null,0,null,0,null,"[3]"]
[null,null,"Total","[4]",{"$f":"SUM(E14:F16)","v":0},null,{"$f":"SUM(G14:H16)","v":0},null,{"$f":"SUM(I14:J16)","v":0},null,{"$f":"SUM(K14:L16)","v":0},null,{"$f":"SUM(M14:N16)","v":0},null,"[4]"]
[null,null,null,null,"[A400]",null,"[A401]",null,"[A402]",null,"[A403]",null,"[A404]"]
[]
[null,null,"Note 1:","Counterparty credit quality categories are defined as follows:"]
[null,null,null,"(a) Category 1 identifies counterparties currently rated AA and above by Standard & Poor's Corporation or equivalent ratings;"]
[]
[null,null,null,"(b) Category 2 identifies counterparties currently rated BBB and above and below AA by Standard & Poor's Corporation or\n      equivalent ratings; and"]
[]
[null,null,null,"(c) Category 3 identifies counterparties currently rated below BBB by Standard & Poor's Corporation or equivalent ratings\n      or without any credit rating."]
[]
[null,null,null,"When basing the above categories on ratings, a licensed corporation's equivalent internal credit grade ranking may be used when investment ratings are not available."]
[]
[]
[null,null,"Note 2:","Current credit exposure of a contract is the market value that would remain if the netting under a legally enforceable bilateral netting agreement is effected.  Current credit exposure should be derived as follows: determine whether a legally enforceable bilateral netting agreement is in place between the licensed corporation and a counterparty.  If such an agreement is in place, the market values of all applicable contracts with that counterparty that are covered by the netting agreement are netted to a single amount.  Next, for all other contracts that have positive market values, the total of the positive market values is determined.  Then, the aggregate of current credit exposure of all contracts is the sum of (i) the net positive market values of applicable contracts subject to legally enforceable bilateral netting agreements and (ii) the total positive market values of all other contracts."]

{"sheet":"Form 10 Table 5","index":18,"n_rows":19,"n_cols":12,"rows_kept":19,"cut":false,"hidden":false,"merged":[[18,11,21,11],[4,8,4,9],[18,3,21,10],[8,2,8,8],[16,3,16,10],[14,3,14,10],[8,9,8,10],[6,9,6,10],[9,9,9,10],[10,9,10,10],[9,2,9,8],[10,2,10,8],[12,3,12,10]]}
[{"$f":"IF(ISBLANK('Form 1 Main'!G14),\"\",\"Financial return of\")&\" \"&IF(ISBLANK('Form 1 Main'!G14),\"\",'Form 1 Main'!G14)","v":"Financial return of "},null,null,null,null,null,null,null,null,null,null,{"$f":"IF(ISBLANK(Config!C7),\"\",Config!C7)","v":""}]
[null,"FORM 10",null,"REPORT ON PROPRIETARY DERIVATIVE POSITIONS"]
[]
[null,"Table 5",null,"Analysis of past due OTC derivative contracts and credit losses"]
[null,null,null,"as of the end of reporting month",null,null,null,null,{"$f":"IF(ISBLANK('Form 1 Main'!L21),\"\",'Form 1 Main'!L21)","v":""},null,"[1004]"]
[]
[null,null,null,null,null,null,null,null,null,"(HK$'000)"]
[]
[null,null,"Gross positive market value of derivative contracts past due 30-89 days",null,null,null,null,null,null,0,null,"[A500]"]
[null,null,"Gross positive market value of derivative contracts past due 90 days or more (Note 1)",null,null,null,null,null,null,0,null,"[A501]"]
[null,null,"Credit losses on derivative contracts during the past month (Notes 2 & 3)",null,null,null,null,null,null,0,null,"[A502]"]
[]
[null,null,"Note 1:","Information about derivatives that are past due 90 days or more should also include information about derivatives that, while not technically past due, are with counterparties that are not expected to pay the full amounts owed to the licensed corporation under the derivative contracts."]
[]
[null,null,"Note 2:","Credit losses include credit provisions made."]
[]
[null,null,"Note 3:","Please describe the licensed corporation's policy on making credit provisions below."]
[]
[null,null,null,"",null,null,null,null,null,null,null,"[A503]"]

{"sheet":"Form 10 Table 6","index":19,"n_rows":32,"n_cols":13,"rows_kept":32,"cut":false,"hidden":false,"merged":[[7,10,9,10],[15,10,16,10],[18,10,19,10],[20,10,24,10],[5,5,5,11],[18,12,19,12],[20,12,24,12],[13,2,13,4],[7,9,9,9],[7,11,9,11],[10,2,10,4],[11,2,11,4],[7,2,9,4],[7,5,9,5],[7,6,9,6],[7,7,9,7],[7,8,9,8],[15,6,16,6],[15,7,16,7],[15,8,16,8],[15,5,16,5],[31,3,32,11],[18,11,19,11],[20,5,24,5],[20,6,24,6],[20,7,24,7],[20,8,24,8],[20,9,24,9],[18,2,19,4],[20,2,24,4],[18,5,19,5],[18,6,19,6],[18,7,19,7],[18,8,19,8],[20,11,24,11],[29,3,29,11],[18,9,19,9],[27,3,27,11],[17,2,17,4],[15,2,16,4],[15,9,16,9],[15,11,16,11]]}
[{"$f":"IF(ISBLANK('Form 1 Main'!G14),\"\",\"Financial return of\")&\" \"&IF(ISBLANK('Form 1 Main'!G14),\"\",'Form 1 Main'!G14)","v":"Financial return of "},null,null,null,null,null,null,null,null,null,null,null,{"$f":"IF(ISBLANK(Config!C7),\"\",Config!C7)","v":""}]
[null,"FORM 10","REPORT ON PROPRIETARY DERIVATIVE POSITIONS"]
[]
[null,"Table 6","Derivative-related trading profits and losses for the period ended",null,null,null,null,null,null,{"$f":"IF(ISBLANK('Form 1 Main'!L21),\"\",'Form 1 Main'!L21)","v":""},"[1004]"]
[]
[null,null,null,null,null,"(HK$'000)"]
[]
[null,null,"Derivative-related\ntrading profits and losses\n(Note 1)",null,null,"Equity contracts\n[A600]","Interest rate contracts\n[A601]","Foreign exchange contracts\n[A602]","Precious metals contracts\n[A603]","Other commodity contracts\n[A604]","Virtual assets contracts\n[A604A]","Total\n[A605]"]
[]
[]
[null,null,"(a) Trading",null,null,0,0,0,0,0,0,{"$f":"SUM(F11:K11)","v":0}]
[null,null,"(b) Others (please specify)",null,null,0,0,0,0,0,0,{"$f":"SUM(F12:K12)","v":0}]
[null,null,null,null,null,"[A606]","[A607]","[A608]","[A609]","[A610]","[A610A]","[A611]"]
[null,"[A606A]",""]
[null,null,null,null,null,"[A612]","[A613]","[A614]","[A615]","[A616]","[A616A]","[A617]"]
[null,null,"(c) Total derivative-related \n      trading revenues (a) + (b)",null,null,{"$f":"SUM(F11:F12)","v":0},0,0,0,0,0,{"$f":"SUM(F16:K17)","v":0}]
[]
[]
[null,null,"(d) Total revenues of the licensed \n      corporation (Note 2)",null,null,null,null,null,null,null,null,0,"[A618]"]
[]
[null,null,"(e) Total derivative-related trading \n      revenues as a percentage of \n      licensed corporation's total \n      revenues (c)/(d) x 100%",null,null,null,null,null,null,null,null,{"$f":"ROUND(IF(ISERROR(L16/L19),0,L16/L19),2)","v":0},"[A619]"]
[]
[]
[]
[]
[]
[]
[null,null,"Note 1:","In the case where the derivative trading activities of the licensed corporation include the trading of derivative contracts as well as related cash instruments, derivative-related trading profits and losses should include the trading profits and losses arising from both derivative contract trading and related cash instruments trading.  If a licensed corporation has a different way of calculating the derivative-related trading revenues, please specify the underlying methods and approaches below."]
[]
[null,null,null,"",null,null,null,null,null,null,null,null,"[A620]"]
[]
[null,null,"Note 2:","This means the total revenues of the licensed corporation as a whole including all derivatives and non-derivatives businesses. "]

{"sheet":"Form 11","index":20,"n_rows":54,"n_cols":15,"rows_kept":54,"cut":false,"hidden":false,"merged":[[39,10,39,12],[21,2,21,9],[22,2,22,9],[23,2,23,9],[24,2,24,9],[25,2,25,9],[38,2,38,9],[39,2,39,9],[34,2,34,9],[35,2,35,9],[36,2,36,9],[37,2,37,9],[36,10,36,12],[30,10,30,12],[29,2,29,9],[29,10,29,12],[33,2,33,9],[32,10,32,12],[33,10,33,12],[16,10,16,12],[23,10,23,12],[26,2,26,9],[27,2,27,9],[28,2,28,9],[27,10,27,12],[28,10,28,12],[22,10,22,12],[40,10,40,12],[15,2,15,9],[16,2,16,9],[17,2,17,9],[18,2,18,9],[19,2,19,9],[17,10,17,12],[18,10,18,12],[15,10,15,12],[37,10,37,12],[40,2,40,9],[24,10,24,12],[21,10,21,12],[30,2,30,9],[31,2,31,9],[32,2,32,9],[38,10,38,12],[31,10,31,12],[13,10,13,12],[25,10,25,12],[26,10,26,12],[34,10,34,12],[19,10,19,12],[35,10,35,12],[4,9,4,10],[7,10,7,12],[8,2,10,9],[8,10,10,12],[20,2,20,9],[20,10,20,12],[11,10,11,12],[12,10,12,12],[11,2,11,9],[12,2,12,9],[13,2,13,9],[14,2,14,9],[14,10,14,12]]}
[{"$f":"IF(ISBLANK('Form 1 Main'!G14),\"\",\"Financial return of\")&\" \"&IF(ISBLANK('Form 1 Main'!G14),\"\",'Form 1 Main'!G14)","v":"Financial return of "},null,null,null,null,null,null,null,null,null,null,null,null,null,{"$f":"IF(ISBLANK(Config!C7),\"\",Config!C7)","v":""}]
[null,"FORM 11",null,"LIST OF RECOGNIZED COUNTERPARTIES WITH WHOM "]
[null,null,null,"FOREIGN CURRENCY POSITION  OF LICENSED CORPORATION LICENSED"]
[null,null,null,"FOR LEVERAGED FOREIGN EXCHANGE TRADING IS HELD"]
[null,null,null,"AS OF THE END OF REPORTING MONTH",null,null,null,null,null,{"$f":"IF(ISBLANK('Form 1 Main'!L21),\"\",'Form 1 Main'!L21)","v":""},null,"[1004]","(Note 1)"]
[]
[]
[]
[null,null,"Name of recognized counterparty\n",null,null,null,null,null,null,null,"Qualifying criterion\n(Please enter appropriate qualifying criterion according to Note 2)\n"]
[]
[null," Row",null,null,null,null,null,null,null,null,null,null,null,null,"Row"]
[null,"[1]   [B100]","",null,null,null,null,null,null,null,null,null,null,"[B101]","[1]"]
[null,"[2]   [B102]","",null,null,null,null,null,null,null,null,null,null,"[B103]","[2]"]
[null,"[3]   [B104]","",null,null,null,null,null,null,null,null,null,null,"[B105]","[3]"]
[null,"[4]   [B106]","",null,null,null,null,null,null,null,null,null,null,"[B107]","[4]"]
[null,"[5]   [B108]","",null,null,null,null,null,null,null,null,null,null,"[B109]","[5]"]
[null,"[6]   [B110]","",null,null,null,null,null,null,null,null,null,null,"[B111]","[6]"]
[null,"[7]   [B112]","",null,null,null,null,null,null,null,null,null,null,"[B113]","[7]"]
[null,"[8]   [B114]","",null,null,null,null,null,null,null,null,null,null,"[B115]","[8]"]
[null,"[9]   [B116]","",null,null,null,null,null,null,null,null,null,null,"[B117]","[9]"]
[null,"[10]   [B118]","",null,null,null,null,null,null,null,null,null,null,"[B119]","[10]"]
[null,"[11]   [B120]","",null,null,null,null,null,null,null,null,null,null,"[B121]","[11]"]
[null,"[12]   [B122]","",null,null,null,null,null,null,null,null,null,null,"[B123]","[12]"]
[null,"[13]   [B124]","",null,null,null,null,null,null,null,null,null,null,"[B125]","[13]"]
[null,"[14]   [B126]","",null,null,null,null,null,null,null,null,null,null,"[B127]","[14]"]
[null,"[15]   [B128]","",null,null,null,null,null,null,null,null,null,null,"[B129]","[15]"]
[null,"[16]   [B130]","",null,null,null,null,null,null,null,null,null,null,"[B131]","[16]"]
[null,"[17]   [B132]","",null,null,null,null,null,null,null,null,null,null,"[B133]","[17]"]
[null,"[18]   [B134]","",null,null,null,null,null,null,null,null,null,null,"[B135]","[18]"]
[null,"[19]   [B136]","",null,null,null,null,null,null,null,null,null,null,"[B137]","[19]"]
[null,"[20]   [B138]","",null,null,null,null,null,null,null,null,null,null,"[B139]","[20]"]
[null,"[21]   [B140]","",null,null,null,null,null,null,null,null,null,null,"[B141]","[21]"]
[null,"[22]   [B142]","",null,null,null,null,null,null,null,null,null,null,"[B143]","[22]"]
[null,"[23]   [B144]","",null,null,null,null,null,null,null,null,null,null,"[B145]","[23]"]
[null,"[24]   [B146]","",null,null,null,null,null,null,null,null,null,null,"[B147]","[24]"]
[null,"[25]   [B148]","",null,null,null,null,null,null,null,null,null,null,"[B149]","[25]"]
[null,"[26]   [B150]","",null,null,null,null,null,null,null,null,null,null,"[B151]","[26]"]
[null,"[27]   [B152]","",null,null,null,null,null,null,null,null,null,null,"[B153]","[27]"]
[null,"[28]   [B154]","",null,null,null,null,null,null,null,null,null,null,"[B155]","[28]"]
[null,"[29]   [B156]","",null,null,null,null,null,null,null,null,null,null,"[B157]","[29]"]
[null,"[30]   [B158]","",null,null,null,null,null,null,null,null,null,null,"[B159]","[30]"]
[]
[null,null,"Note 1:","This form should be reported on quarterly basis, i.e. for March, June, September and December only."]
[]
[null,null,"Note 2:","For the purpose of this form, qualifying criterion refers to the following:"]
[null,null,null,"(a)","authorized financial institution;"]
[null,null,null,"(b)","licensed corporation licensed for leveraged foreign exchange trading;"]
[null,null,null,"(c)","corporation licensed for dealing in futures contracts that deals in currency futures contracts on any specified futures exchange;"]
[null,null,null,"(d)","equivalent corporation that deals in currency futures contracts on any specified futures exchange;"]
[null,null,null,"(e)","bank incorporated in a specified jurisdiction and regulated by a specified bank regulator in that jurisdiction;"]
[null,null,null,"(f)","corporation that has issued debt instruments which continue to attract a qualifying credit rating; or"]
[null,null,null,"(g)","institution which the Commission is satisfied with its recognition as counterparty."]
[]
[null,null,null,"Please refer to Securities and Futures (Recognized Counterparty) Rules for details of qualifying criteria of recognized counterparty."]

{"sheet":"Form 12","index":21,"n_rows":68,"n_cols":23,"rows_kept":68,"cut":false,"hidden":false,"merged":[[67,4,67,20],[56,5,56,20],[57,5,57,20],[58,5,58,20],[59,5,59,20],[60,4,60,20],[62,5,62,20],[63,4,63,20],[65,4,65,21],[61,5,61,20],[47,5,47,10],[34,3,34,20],[42,12,42,13],[64,4,64,20],[42,14,42,15],[42,16,42,18],[42,19,43,19],[48,5,48,10]]}
[{"$f":"IF(ISBLANK('Form 1 Main'!G14),\"\",\"Financial return of\")&\" \"&IF(ISBLANK('Form 1 Main'!G14),\"\",'Form 1 Main'!G14)","v":"Financial return of "},null,null,null,null,null,null,null,null,null,null,null,null,null,null,null,null,null,null,null,null,{"$f":"IF(ISBLANK(Config!C7),\"\",Config!C7)","v":""}]
[null,null,"FORM 12",null,null,"CLIENTELE AND ASSETS UNDER MANAGEMENT AS OF THE END OF REPORTING MONTH",null,null,null,null,null,null,null,null,null,null,null,null,null,null,{"$f":"IF(ISBLANK('Form 1 Main'!L21),\"\",'Form 1 Main'!L21)","v":""},"[1004]  (Note 1)"]
[]
[]
[]
[null,null,"A.","Clientele"]
[]
[null,null,null,"Number of active clients (Note 2)"]
[null,null,null,"(i)","By service type and geographical location of the client (Note 3)"]
[null,null,null,null,null,null,null,null,null,null,null,"Row",null,null,null,"Hong Kong ","Mainland China ","Asia Pacific excluding Hong Kong and Mainland China","United States of America ","Others ","Total",null,"Row"]
[null,null,null,null,"Securities clients (other than clients dealing in stock options contracts)"]
[null,null,null,null,"- cash clients",null,null,null,null,null,null,"[1]",null,null,null,0,0,0,0,0,{"$f":"SUM(P12:T12)","v":0},"[C100A]","[1]"]
[null,null,null,null,"- rolling balance cash clients",null,null,null,null,null,null,"[2]",null,null,null,0,0,0,0,0,{"$f":"SUM(P13:T13)","v":0},"[C100B]","[2]"]
[null,null,null,null,"- margin clients",null,null,null,null,null,null,"[3]",null,null,null,0,0,0,0,0,{"$f":"SUM(P14:T14)","v":0},"[C101]","[3]"]
[null,null,null,null,null,null,null,null,null,null,null,"[4]",null,null,null,{"$f":"SUM(P12:P14)","v":0},0,0,0,0,0,"[C102]","[4]"]
[null,null,null,null,"Futures and options (including stock options) clients",null,null,null,null,null,null,"[5]",null,null,null,0,0,0,0,0,{"$f":"SUM(P16:T16)","v":0},"[C103]","[5]"]
[null,null,null,null,"Leveraged foreign exchange trading clients",null,null,null,null,null,null,"[6]",null,null,null,0,0,0,0,0,{"$f":"SUM(P17:T17)","v":0},"[C104]","[6]"]
[null,null,null,null,"Clients to whom the licensed corporation provides services of"]
[null,null,null,null,"- advising on securities or futures contracts",null,null,null,null,null,null,"[7]",null,null,null,0,0,0,0,0,{"$f":"SUM(P19:T19)","v":0},"[C105A]","[7]"]
[null,null,null,null,"- advising on corporate finance",null,null,null,null,null,null,"[8]",null,null,null,0,0,0,0,0,{"$f":"SUM(P20:T20)","v":0},"[C105B]","[8]"]
[null,null,null,null,"- asset management",null,null,null,null,null,null,"[9]",null,null,null,0,0,0,0,0,{"$f":"SUM(P21:T21)","v":0},"[C105C]","[9]"]
[null,null,null,null,"Virtual assets (including virtual assets which constitute securities) clients",null,null,null,null,null,null,"[9A]",null,null,null,0,0,0,0,0,{"$f":"SUM(P22:T22)","v":0},"[C105D]","[9A]"]
[null,null,null,null,"Others",null,null,null,null,null,null,"[10]",null,null,null,0,0,0,0,0,{"$f":"SUM(P23:T23)","v":0},"[C106]","[10]"]
[]
[]
[null,null,null,"(ii)","By client type"]
[]
[null,null,null,null,"Institutional Professional Investors (Note 4)",null,null,null,null,null,null,null,null,null,null,null,null,null,null,null,0,"[C106A]"]
[null,null,null,null,"Corporate Professional Investors (Note 4)",null,null,null,null,null,null,null,null,null,null,null,null,null,null,null,0,"[C106B]"]
[null,null,null,null,"Individual Professional Investors (Note 4)",null,null,null,null,null,null,null,null,null,null,null,null,null,null,null,0,"[C106C]"]
[null,null,null,null,"Others (Note 4b)",null,null,null,null,null,null,null,null,null,null,null,null,null,null,null,0,"[C106D]"]
[null,null,null,null,"Total",null,null,null,null,null,null,null,null,null,null,null,null,null,null,null,{"$f":"SUM(U28:U31)","v":0},"[C106E]"]
[]
[]
[null,null,"B.","Aggregate net value of assets under management (\"AUM\") by investment strategy and account type (to be reported by licensed corporation licensed for Type 9 regulated activity)"]
[]
[]
[]
[]
[]
[]
[]
[null,null,null,null,null,null,null,null,null,null,null,null,"Collective investment schemes\n(excluding open-ended fund companies)",null,"Open-ended fund companies",null,"Discretionary accounts",null,null,"Other asset management clients\n(Note 5)","Total"]
[null,null,null,null,null,null,null,null,null,null,null,null,"SFC- authorized ","Others","SFC- authorized ","Others","Discretionary accounts held by (i) directors, shareholders or employees of the licensed corporation, or (ii) group affiliates of the licensed corporation","Discretionary accounts held by other individuals","Other discretionary accounts (including sovereign, non-group affiliated corporate, institutional professional investor and pension fund account etc.)"]
[null,null,null,null,null,null,null,null,null,null,null,null,"\n(HK$'000)","\n(HK$'000)","\n(HK$'000)","\n(HK$'000)","\n(HK$'000)","\n(HK$'000)","\n(HK$'000)","\n(HK$'000)","\n(HK$'000)"]
[null,null,null,null,"-","Hedge fund strategies (A) ",null,null,null,null,null,"[11]",0,0,0,0,0,0,0,0,{"$f":"SUM(M46:T46)","v":0},"[C106F]","[11]"]
[null,null,null,null,"-","Private equity strategies (B)",null,null,null,null,null,"[12]",0,0,0,0,0,0,0,0,{"$f":"SUM(M47:T47)","v":0},"[C106G]","[12]"]
[null,null,null,null,"-","Passive index tracking (excluding those reported under (A) and (B) above) (C) (Note 6)",null,null,null,null,null,"[13]",0,0,0,0,0,0,0,0,{"$f":"SUM(M48:T48)","v":0},"[C106H]","[13]"]
[null,null,null,null,"-","Virtual asset / virtual asset derivatives strategies (including virtual assets which constitute securities) (CA)",null,null,null,null,null,"[13a]",0,0,0,0,0,0,0,0,{"$f":"SUM(M49:T49)","v":0},"[C106HA]","[13a]"]
[null,null,null,null,"-","Other strategies (D)",null,null,null,null,null,"[14]",0,0,0,0,0,0,0,0,{"$f":"SUM(M50:T50)","v":0},"[C106I]","[14]"]
[null,null,null,null,"    Total aggregate net value of AUM = (A) + (B) + (C) + (CA) + (D)",null,null,null,null,null,null,null,{"$f":"SUM(M46:M50)","v":0},{"$f":"SUM(N46:N50)","v":0},{"$f":"SUM(O46:O50)","v":0},{"$f":"SUM(P46:P50)","v":0},{"$f":"SUM(Q46:Q50)","v":0},{"$f":"SUM(R46:R50)","v":0},0,0,0]
[null,null,null,null,null,null,null,null,null,null,null,null,"[C107A]","[C108A]","[C107B]","[C108B]","[C109A]","[C109B]","[C109C]","[C109D]","[C110]"]
[]
[]
[]
[]
[null,null,"Note 1:",null,"(a)","This form is to be submitted on a semi-annual basis by a licensed corporation which is subject to specified licensing condition and licensed solely for one or more of the following activities: advising on securities, advising on futures contracts, advising on corporate finance, providing asset management, or providing credit rating services."]
[null,null,null,null,"(b)","Licensed corporations other than those mentioned in Note 1(a) should submit this form on a quarterly basis, i.e. for March, June, September and December."]
[null,null,"Note 2:",null,"(a)","Active clients are clients for whom the licensed corporation\n(i) is required to prepare and deliver monthly statements of account in respect of the relevant reporting month in accordance with the Securities and Futures (Contract Notes, Statements of Account and Receipts) Rules; or\n(ii) by whom the licensed corporation is remunerated for providing advisory services (including advising on securities, futures contracts or corporate finance) or asset management services during the past 3 months (6 months in the case of a licensed corporation submitting this form only on a semi-annual basis)."]
[null,null,null,null,"(b)","Where a client receives services from the licensed corporation which involve more than one type of regulated activity / virtual asset service, such client shall be counted as an active client for each type of the regulated activity / virtual asset service involved."]
[null,null,"Note 3:",null,"Geographical location of a client refers to the location of the correspondence address provided by the client."]
[null,null,"Note 4:",null,"(a)","Please refer to paragraph 15.2 of the Code of Conduct for Persons Licensed by or Registered with the Securities and Futures Commission for the definitions of \"Institutional Professional Investor\", \"Corporate Professional Investor\" and \"Individual Professional Investor\"."]
[null,null,null,null,"(b)","Licensed corporation should complete the table based on its latest available assessment result."]
[null,null,"Note 5:",null,"Please specify."]
[null,null,null,null,null,null,null,null,null,null,null,null,null,null,null,null,null,null,null,null,null,"[C111]"]
[]
[]
[null,null,"Note 6:",null,"For non-purely passive index tracking strategies (e.g., Smart Beta), the relevant AUM should be reported under \"other strategies\"."]

{"sheet":"MIC Config","index":22,"n_rows":1851,"n_cols":3,"rows_kept":1851,"cut":false,"hidden":true,"merged":[]}
["MIC","NAME-INSTITUTION DESCRIPTION","Length of List"]
["ISIN","INTERNATIONAL SECURITIES IDENTIFICATION NUMBER",1850]
["SEDOL","STOCK EXCHANGE DAILY OFFICIAL LIST"]
["** MIC As Following **"]
["3579","SSY FUTURES LTD -  FREIGHT SCREEN"]
["360T","360T"]
["A2XX","A2X"]
["AACA","CREDIT AGRICOLE CIB - SYSTEMATIC INTERNALISER"]
["AAPA","ATHENS EXCHANGE - APA"]
["AATS","ASSENT ATS"]
["ABAN","ABANCA"]
["ABNA","ABN AMRO BANK NV - SYSTEMATIC INTERNALISER"]
["ABSI","ALM. BRAND BANK - SYSTEMATIC INTERNALISER"]
["ABUL","BULGARIAN STOCK EXCHANGE - ALTERNATIVE MARKET"]
["ACEX","ACE DERIVATIVES & COMMODITY EXCHANGE LTD"]
["ACKF","KCG ACKNOWLEDGE FI"]
["ADVT","ADVISE TECHNOLOGIES - APA TRANSPARENCY REPORTING"]
["AFDL","ABIDE FINANCIAL DRSP LIMITED APA"]
["AFET","AGRICULTURAL FUTURES EXCHANGE OF THAILAND"]
["AFSA","AFS - OTF"]
["AFSI","AFS - OTF - INTEREST RATE DERIVATIVES"]
["AFSL","AFS - OTF - STRUCTURED PRODUCTS"]
["AFSO","AFS - OTF - BONDS"]
["AFSX","AFS - OTF - FX FORWARDS"]
["AGBP","A AND G BANCA PRIVADA SAU"]
["AIMX","LONDON STOCK EXCHANGE - AIM MTF"]
["AIXK","ASTANA INTERNATIONAL EXCHANGE LTD"]
["AKIS","AKIS - BANCA AKROS - SYSTEMATIC INTERNALISER"]
["ALDP","NYSE ALTERNEXT DARK"]
["ALLT","ALLT-OTF"]
["ALSI","AKTIESELSKABET ARBEJDERNES LANDSBANK - SYSTEMATIC INTERNALISER"]
["ALTX","JSE ALTERNATE EXCHANGE"]
["ALXB","EURONEXT GROWTH BRUSSELS"]
["ALXL","EURONEXT GROWTH LISBON"]
["ALXP","EURONEXT GROWTH PARIS"]
["AMPX","ASSET MATCH PRIVATE EXCHANGE"]
["AMTS","MTS NETHERLANDS"]
["AMXO","NYSE AMEX OPTIONS"]
["ANLP","AUSTRALIA AND NEW ZEALAND BANKING GROUP LIMITED"]
["ANTS","ABBEY NATIONAL TREASURY SERVICES PLC - SYSTEMATIC INTERNALISER"]
["ANZL","AUSTRALIA AND NEW ZEALAND BANKING GROUP LIMITED SYSTEMATIC INTERNALISER"]
["APAW","WIENER BOERSE AG - APA"]
["APCL","ASIA PACIFIC CLEAR"]
["APEX","ASIA PACIFIC EXCHANGE"]
["APXL","SYDNEY STOCK EXCHANGE LIMITED"]
["AQEA","AQUIS EXCHANGE EUROPE AUCTION ON DEMAND (AOD)"]
["AQEU","AQUIS EXCHANGE EUROPE"]
["AQUA","AQUA EQUITIES L.P."]
["AQXA","AQUIS EXCHANGE PLC AUCTION ON DEMAND (AOD)"]
["AQXE","AQUIS EXCHANGE PLC"]
["ARAX","ARAX COMMODITIES LTD"]
["ARCD","ARCA DARK"]
["ARCO","NYSE ARCA OPTIONS"]
["ARCX","NYSE ARCA"]
["AREX","AREX - AUTOMATED RECEIVABLES EXCHANGE"]
["ARIA","ARIAN TRADING FACILITY"]
["ASEX","ATHENS STOCK EXCHANGE"]
["ASTR","CLEARCORP DEALING SYSTEMS INDIA LIMITED – ASTROID"]
["ASXB","ASX BOOKBUILD"]
["ASXC","ASX - CENTRE POINT"]
["ASXP","ASX - PUREMATCH"]
["ASXT","ASX TRADEMATCH"]
["ASXV","ASX - VOLUMEMATCH"]
["ATDF","AUTOMATED TRADING DESK FINANCIAL SERVICES, LLC"]
["ATFX","ATFUND MTF"]
["ATHL","ATHLOS CAPITAL INVESTMENT SERVICES LTD - SYSTEMATIC INTERNALISER"]
["ATLB","BRAEMAR ATLANTIC SECURITIES LTD"]
["ATLN","ATONLINE LIMITED - SYSTEMATIC INTERNALISER"]
["AURB","AUREL"]
["AURO","AUREL - OTF"]
["AUTB","AUTILLA - BASE METALS"]
["AUTO","AUTOBAHN FX"]
["AUTP","AUTILLA - PRECIOUS METALS"]
["AUTX","AUTILLA"]
["AWBX","AUSTRALIAN WHEAT BOARD"]
["AWEX","AUSTRALIAN WOOL EXCHANGE"]
["AXSI","ALEXANDRIA PANKKIIRILIIKE OYJ - SYSTEMATIC INTERNALISER"]
["BAAD","BAADER BANK - SYSTEMATIC INTERNALISER"]
["BACE","BOLSA DE CEREALES DE BUENOS AIRES"]
["BAEP","BANK OF AMERICA MERRILL LYNCH EQUITY SWAP - EXTERNAL PRICE SOURCE"]
["BAIP","BANK OF AMERICA MERRILL LYNCH EQUITY SWAP - INTERNAL PRICE SOURCE"]
["BAJM","BARBADOS STOCK EXCHANGE - JUNIOR MARKET"]
["BALT","THE BALTIC EXCHANGE"]
["BAML","BANK OF AMERICA - MERRILL LYNCH INSTINCT X ATS"]
["BAMX","BANK OF AMERICA - MERRILL LYNCH GCX"]
["BANA","BANK OF AMERICA, NATIONAL ASSOCIATION"]
["BAPA","BLOOMBERG - APA"]
["BAPE","BLOOMBERG DATA REPORTING SERVICES B.V. - APA"]
["BAPX","BALTPOOL"]
["BARD","BARCLAYS FX – TRADING"]
["BARK","CBOE EUROPE - REGULATED MARKET DARK BOOK"]
["BARL","BARCLAYS LIQUID MARKETS"]
["BARO","CBOE EUROPE - REGULATED MARKET OFF BOOK"]
["BART","CBOE EUROPE - REGULATED MARKET INTEGRATED BOOK"]
["BARU","CBOE EUROPE - REGULATED MARKET DARK BOOK (NL)"]
["BARX","BARCLAYS ATS"]
["BASE","BANK OF AMERICA MERRILL LYNCH - SWAP EXECUTIONS"]
["BASI","BANK OF AMERICA, NATIONAL ASSOCIATION - LONDON BRANCH OFFICE - SYSTEMATIC INTERNALISER"]
["BASX","BANK OF AMERICA MERRILL LYNCH – SIMPLEX BLAST X"]
["BATD","CBOE EUROPE -BXE DARK ORDER BOOK"]
["BATE","CBOE EUROPE -BXE ORDER BOOKS"]
["BATF","CBOE EUROPE – BXE OFF-BOOK"]
["BATO","CBOE BZX OPTIONS EXCHANGE"]
["BATP","CBOE EUROPE - BXE PERIODIC"]
["BATS","CBOE BZX U.S. EQUITIES EXCHANGE"]
["BATY","CBOE BYX U.S. EQUITIES EXCHANGE"]
["BBIE","BARCLAYS BANK IRELAND PLC"]
["BBIS","BARCLAYS BANK IRELAND PLC - SYSTEMATIC INTERNALISER"]
["BBSF","BLOOMBERG SEF LLC"]
["BBSI","BARCLAYS BANK PLC - SYSTEMATIC INTERNALISER"]
["BBVA","BANCO BILBAO VIZCAYA ARGENTARIA S.A - SYSTEMATIC INTERNALISER"]
["BCDX","BARCLAYS DIRECT EX ATS"]
["BCEE","BANQUE ET CAISSE D'EPARGNE DE L'ETAT, LUXEMBOURG - BCEE - SYSTEMATIC INTERNALISER"]
["BCFS","BOLSA DE COMERCIO DE SANTA FE"]
["BCMA","BANCA MARCH S.A. - SYSTEMATIC INTERNALISER"]
["BCMM","BOLSA DE CEREAIS E MERCADORIAS DE MARINGÁ"]
["BCRM","CBOE EUROPE REGULATED MARKETS"]
["BCSC","BROKERCREDITSERVICE (CYPRUS) LIMITED - SYSTEMATIC INTERNALISER"]
["BCSE","BELARUS CURRENCY AND STOCK EXCHANGE"]
["BCSI","BARCLAYS CAPITAL SECURITIES LIMITED - SYSTEMATIC INTERNALISER"]
["BCSL","BARCLAYS CAPITAL SECURITIES LIMITED"]
["BCXE","CBOE EUROPE EQUITIES"]
["BDEA","BAYERNLB - IDEAL FX - SYSTEMATIC INTERNALISER"]
["BEAM","MTS ASSOCIATED MARKETS"]
["BEEX","BOND ELECTRONIC EXCHANGE"]
["BEIS","BANCA ETICA - SYSTEMATIC INTERNALISER"]
["BELB","BELFIUS BANK NV/SA"]
["BELF","BELFIUS BANK NV/SA FIXED INCOME - SYSTEMATIC INTERNALISER"]
["BERA","BOERSE BERLIN - REGULIERTER MARKT"]
["BERB","BOERSE BERLIN - FREIVERKEHR"]
["BERC","BOERSE BERLIN - BERLIN SECOND REGULATED MARKET"]
["BETA","BETA MARKET"]
["BETP","BLOOMBERG TRADEBOOK JAPAN LIMITED"]
["BETX","BET OTC BILAT COMMODITY DERIVATIVES"]
["BEUD","CBOE EUROPE - BXE DARK ORDER BOOK (NL)"]
["BEUE","CBOE EUROPE - BXE ORDER BOOKS (NL)"]
["BEUF","CBOE EUROPE - BXE OFF-BOOK (NL)"]
["BEUO","CBOE EUROPE - REGULATED MARKET OFF BOOK (NL)"]
["BEUP","CBOE EUROPE - BXE PERIODIC (NL)"]
["BEUT","CBOE EUROPE - REGULATED MARKET INTEGRATED BOOK (NL)"]
["BFEX","BAHRAIN FINANCIAL EXCHANGE"]
["BGCB","BGC BROKERS LP - TRAYPORT"]
["BGCD","BGC DERIVATIVE MARKETS L.P."]
["BGCF","BGC FINANCIAL INC"]
["BGCI","BGC BROKERS LP"]
["BGCO","BGC BROKERS LP - OTF"]
["BGFI","BERENBERG FIXED INCOME - SYSTEMATIC INTERNALISER"]
["BGFX","BERENBERG FX - SYSTEMATIC INTERNALISER"]
["BGSI","BERENBERG - SYSTEMATIC - INTERNALISER"]
["BHSF","BATS HOTSPOT SEF LLC"]
["BHWA","BANK HANDLOWY W WARSZAWIE S.A. - SYSTEMATIC INTERNALISER"]
["BIDS","BIDS TRADING L.P."]
["BILT","OFF-EXCHANGE TRANSACTIONS - LISTED AND UNLISTED INSTRUMENTS"]
["BINV","BOND INVEST - SYSTEMATIC INTERNALISER"]
["BISI","GOLDMAN SACHS INTERNATIONAL BANK - SYSTEMATIC INTERNALISER"]
["BIVA","BOLSA INSTITUCIONAL DE VALORES"]
["BKBF","BNY MELLON S.A./N.V. - BRUSSELS BRANCH - SYSTEMATIC INTERNALISER"]
["BKBR","BNY MELLON S.A./N.V. - BRUSSELS BRANCH"]
["BKDM","BNY MELLON MARKETS EUROPE LIMITED"]
["BKLF","BNY MELLON - SYSTEMATIC INTERNALISER"]
["BKLN","BNY MELLON INTERNATIONAL - LONDON BRANCH"]
["BKSK","BKS BANK AG - SYSTEMATIC INTERNALISER"]
["BLBB","BAYERNLB"]
["BLBF","BANJA LUKA STOCK EXCHANGE - FREE MARKET"]
["BLBS","BAYERNLB - BONDS MARKET - SYSTEMATIC INTERNALISER"]
["BLEQ","BAYERNLB - EQUITIES MARKET"]
["BLEV","BLOCK EVENT"]
["BLIQ","BAYERNLB - LIQP BONDS MARKET"]
["BLKX","INSTINET BLOCKCROSS ATS"]
["BLNK","BLINK MTF"]
["BLOX","BLOCKMATCH DARK"]
["BLPX","BELGIAN POWER EXCHANGE"]
["BLTD","BLOOMBERG TRADEBOOK LLC"]
["BLTX","BALTEX - FREIGHT DERIVATIVES MARKET"]
["BLUE","PRO SECURITIES ATS"]
["BLUX","BANQUE DE LUXEMBOURG - SYSTEMATIC INTERNALISER"]
["BLXA","INSTINET BLX (AU)"]
["BMCL","BME CLEARING S.A."]
["BMEA","BME - APA"]
["BMEX","BME - BOLSAS Y MERCADOS ESPANOLES"]
["BMLB","BANK OF MONTREAL - LONDON BRANCH - SYSTEMATIC INTERNALISER"]
["BMLX","BANK OF AMERICA MERRILL LYNCH INTERNATIONAL BANK DESIGNATED ACTIVITY COMPANY"]
["BMSI","BANK OF AMERICA MERRILL LYNCH INTERNATIONAL BANK DESIGNATED ACTIVITY COMPANY - SYSTEMATIC INTERNALISER"]
["BMTF","BLOOMBERG TRADING FACILITY LIMITED"]
["BMTS","MTS BELGIUM"]
["BNDD","TRADEWEB DIRECT LLC"]
["BNLD","BANCA NAZIONALE DEL LAVORO SPA - SYSTEMATIC INTERNALISER"]
["BNPA","BNP PARIBAS ARBITRAGE SNC - SYSTEMATIC INTERNALISER"]
["BNPF","BNP PARIBAS FORTIS SA/NV- SYSTEMATIC INTERNALISER"]
["BNPP","BANK BGZ BNP PARIBAS S.A. - SYSTEMATIC INTERNALISER"]
["BNPS","BNP PARIBAS SA - SYSTEMATIC INTERNALISER"]
["BNSX","THE BANK OF NOVA SCOTIA - SYSTEMATIC INTERNALISER"]
["BNTW","BLOCKMATCH MTF NT"]
["BNYC","CONVERGEX"]
["BOAL","BANK OF AMERICA, NATIONAL ASSOCIATION - LONDON BRANCH OFFICE"]
["BOAT","CINNOBER BOAT"]
["BOFS","BANK OF SCOTLAND PLC - SYSTEMATIC INTERNALISER"]
["BOSC","BONDSCAPE"]
["BOSD","NASDAQ OMX BX DARK"]
["BOSP","WARSAW STOCK EXCHANGE/BONDS/CATALYST/BONDSPOT/MTF"]
["BOTC","OFF EXCHANGE IDENTIFIER FOR OTC TRADES REPORTED TO CBOE EUROPE"]
["BOTE","BOTSWANA STOCK EXCHANGE - EXCHANGE TRADED FUNDS (ETF)"]
["BOTV","BOTSWANA STOCK EXCHANGE - VENTURE CAPITAL"]
["BOVA","BOLSA DE CORREDORES - BOLSA DE VALORES"]
["BOVM","BOLSA DE VALORES MINAS-ESPÍRITO SANTO-BRASÍLIA"]
["BPKO","PKO BANK POLSKI S.A. - SYSTEMATIC INTERNALISER"]
["BPLC","BARCLAYS BANK PLC"]
["BPOL","BLOOMBERG BPOOL"]
["BPSX","BNP PARIBAS SECURITIES SERVICES - SYSTEMATIC INTERNALISER"]
["BRDE","BRD - GROUPE SOCIETE GENERALE S.A."]
["BRDL","BRD - GROUPE SOCIETE GENERALE S.A. - LIQUIDITY PROVIDER"]
["BRDS","BRD - GROUPE SOCIETE GENERALE S.A. - SYSTEMATIC INTERNALISER"]
["BREA","BANCA REALE - SYSTEMATIC INTERNALISER"]
["BRFQ","BLOCKMATCH MTF RFQ"]
["BRGA","BRYAN GARNIER AND CO LIMITED"]
["BRIX","BRAZILIAN ENERGY EXCHANGE"]
["BRNX","BERNSTEIN CROSS (BERN-X)"]
["BSEX","BAKU STOCK EXCHANGE"]
["BSFX","BAYERNLB - FX HANDEL - SYSTEMATIC INTERNALISER"]
["BSME","BSE SME"]
["BTAM","CME AMSTERDAM B.V."]
["BTEC","ICAP ELECTRONIC BROKING (US)"]
["BTEE","BROKERTEC EUROPE LIMITED - ALL MARKETS"]
["BTFE","BLOOMBERG TRADING FACILITY B.V."]
["BTLX","BTL OTC BILAT COMMODITY DERIVATIVES"]
["BTNL","BITNOMIAL"]
["BULK","NASDAQ COMMODITIES - BULK COMMODITY"]
["BVCA","CARACAS STOCK EXCHANGE"]
["BVMF","BM&FBOVESPA S.A. - BOLSA DE VALORES, MERCADORIAS E FUTUROS"]
["BVUK","BONDVISION UK"]
["BVUR","BOLSA ELECTRONICA DE VALORES DEL URUGUAY"]
["BVUS","BONDVISION US"]
["BYXD","CBOE BYX U.S. EQUITIES EXCHANGE DARK"]
["BZXD","CBOE BZX U.S. EQUITIES EXCHANGE DARK"]
["C2OX","C2 OPTIONS EXCHANGE INC."]
["CABK","CAIXABANK - SYSTEMATIC INTERNALISER"]
["CABV","CME AMSTERDAM B.V. - APA"]
["CAES","CREDIT SUISSE AES CROSSFINDER"]
["CAND","CANDEAL.CA INC"]
["CANX","CANNEX FINANCIAL EXCHANGE LTS"]
["CAPA","CBOE EUROPE - APA (NL)"]
["CAPI","CAPI - OTF"]
["CASI","CARNEGIE INVESTMENT BANK AB - SYSTEMATIC INTERNALISER"]
["CATS","CATS"]
["CAVD","CAVENDISH MARKETS B.V."]
["CAVE","CAVEAT EMPTOR"]
["CBAL","COMMONWEALTH BANK OF AUSTRALIA - LONDON BRANCH - SYSTEMATIC INTERNALISER"]
["CBKA","COMMERZBANK AG"]
["CBKC","COMMERZBANK  COMMODITY DERIVATIVES - SYSTEMATIC INTERNALISER"]
["CBKD","COMMERZBANK EQUITY DERIVATIVES - SYSTEMATIC INTERNALISER"]
["CBKE","COMMERZBANK EQUITY - SYSTEMATIC INTERNALISER"]
["CBKF","COMMERZBANK COMMANDER - SYSTEMATIC INTERNALISER"]
["CBKG","COMMERZBANK FIXED INCOME - SYSTEMATIC INTERNALISER"]
["CBLC","CITIBLOC"]
["CBNL","CITIBANK N.A. - LONDON BRANCH"]
["CBSX","CBOE STOCK EXCHANGE"]
["CBTS","CME SWAPS MARKETS (CBOT)"]
["CCEU","CITADEL CONNECT EUROPE - SYSTEMATIC INTERNALISER"]
["CCEX","CASPY COMMODITY EXCHANGE"]
["CCFX","CHINA FINANCIAL FUTURES EXCHANGE"]
["CCLX","FINESTI S.A."]
["CCML","CONTINENTAL CAPITAL MARKETS LIMITED - OTF"]
["CCMS","CONTINENTAL CAPITAL MARKETS S.A."]
["CCO2","CANTORCO2E.COM LIMITED"]
["CCRM","CBOE EUROPE REGULATED MARKETS (NL)"]
["CCXE","CBOE EUROPE EQUITIES - EUROPEAN EQUITIES (NL)"]
["CDED","CITADEL SECURITIES"]
["CDSL","CLEARCORP DEALING SYSTEMS (INDIA) LTD."]
["CECS","CME SWAPS MARKETS (COMEX)"]
["CELP","ČESKOSLOVENSKÁ OBCHODNÍ BANKA, A.S. - OTHER LIQUIDITY PROVIDER (OLP)"]
["CEPL","CITIBANK EUROPE PLC"]
["CESI","ČESKOSLOVENSKÁ OBCHODNÍ BANKA, A.S. - SYSTEMATIC INTERNALISER"]
["CETI","CETIP S.A. - MERCADOS ORGANIZADOS"]
["CEUD","CBOE EUROPE - CXE DARK ORDER BOOK (NL)"]
["CEUO","CBOE EUROPE - CXE OFF-BOOK (NL)"]
["CEUX","CBOE EUROPE - CXE ORDER BOOKS (NL)"]
["CFAU","CROSSFINDER AUSTRALIA"]
["CFBC","CHINA FOREIGN EXCHANGE TRADE SYSTEM - SHANGHAI - HONG KONG BOND CONNECT"]
["CFHK","CROSSFINDER HONG KONG"]
["CFIF","CREDIT FINANCIER INVEST (CFI) LTD"]
["CFJP","CROSSFINDER JAPAN"]
["CFTW","CROSSFINDER TAIWAN"]
["CGCM","CASSA DI COMPENSAZIONE E GARANZIA SPA - COLLATERALIZED MONEY MARKET GUARANTEE SERVICE"]
["CGDB","CASSA DI COMPENSAZIONE E GARANZIA SPA - BONDS CCP SERVICE"]
["CGEB","CASSA DI COMPENSAZIONE E GARANZIA SPA - EURO BONDS CCP SERVICE"]
["CGEC","CGEC - CITIGROUP GLOBAL MARKETS  EUROPE AG - CENTRAL RISK DESK"]
["CGEE","CITI MATCH - DE"]
["CGET","CITIGROUP GLOBAL MARKETS  EUROPE AG - EMEA TRADING"]
["CGGD","CASSA DI COMPENSAZIONE E GARANZIA SPA - CCP AGRICULTURAL COMMODITY DERIVATIVES"]
["CGIT","CASSA DI COMPENSAZIONE E GARANZIA SPA"]
["CGMA","CITI MATCH AUSTRALIA"]
["CGMC","CITIGROUP GLOBAL MARKETS  LIMITED - CENTRAL RISK DESK"]
["CGMD","CITIGROUP GLOBAL MARKETS EUROPE AG - SYSTEMATIC INTERNALISER"]
["CGME","CITI MATCH - GB"]
["CGMH","CITI MATCH - HK"]
["CGMI","CITIGROUP GLOBAL MARKETS"]
["CGML","CITIGROUP GLOBAL MARKETS LIMITED"]
["CGMT","CITIGROUP GLOBAL MARKETS  LIMITED - EMEA TRADING"]
["CGMX","CITI MEXICO RPI (RETAIL PRICE IMPROVEMENT)"]
["CGND","CASSA DI COMPENSAZIONE E GARANZIA SPA - CCP ENERGY DERIVATIVES"]
["CGQD","CASSA DI COMPENSAZIONE E GARANZIA SPA - CCP EQUITY DERIVATIVES"]
["CGQT","CASSA DI COMPENSAZIONE E GARANZIA SPA - EQUITY CCP SERVICE"]
["CGTR","CASSA DI COMPENSAZIONE E GARANZIA SPA - TRIPARTY REPO CCP SERVICE"]
["CHEV","CA CHEUVREUX"]
["CHIA","CHI-X AUSTRALIA"]
["CHIC","CHI-X CANADA ATS"]
["CHID","CBOE EUROPE - CXE DARK ORDER BOOK"]
["CHIJ","CHI-X JAPAN"]
["CHIO","CBOE EUROPE - CXE OFF-BOOK"]
["CHIS","CHI-X JAPAN SELECT"]
["CHIV","CHI-X JAPAN VWAP CROSSING"]
["CHIX","CBOE EUROPE - CXE ORDER BOOKS"]
["CIBC","CANADIAN IMPERIAL BANK OF COMMERCE - SYSTEMATIC INTERNALISER"]
["CIBH","CIB BANK - SYSTEMATIC INTERNALISER"]
["CIBP","CIBC WORLD MARKETS PLC - SYSTEMATIC INTERNALISER"]
["CICX","CITI CROSS"]
["CIMB","CIMD S.V. S.A. - OTF FOR BONDS"]
["CIMD","CIMD S.V. S.A. - OTF"]
["CIME","CIMD S.V. S.A. - OTF FOR ENERGY DERIVATIVES"]
["CIMV","CIMD S.V. S.A. - OTF FOR DERIVATIVES"]
["CIOI","CIOI"]
["CITD","CITI DARK"]
["CITX","CITI MATCH - JP"]
["CLAU","CLSA AUSTRALIA - DARK"]
["CLHK","CLSA HONG KONG - DARK"]
["CLJP","CLSA JAPAN - DARK"]
["CLMX","CLIMEX"]
["CLPH","CLSA PHILIPPINES - DARK"]
["CLTD","CLEARTRADE EXCHANGE"]
["CMCI","CREDIT INDUSTRIEL ET COMMERCIAL - SYSTEMATIC INTERNALISER"]
["CMEC","CME CLEARING EUROPE"]
["CMEE","CME  EUROPE"]
["CMES","CME SWAPS MARKETS (CME)"]
["CMET","CLEAR MARKETS JAPAN, INC."]
["CMMT","CLEAR MARKETS EUROPE LIMITED"]
["CMSF","CLEAR MARKETS NORTH AMERICA, INC."]
["CNSI","CARNEGIE AS - SYSTEMATIC INTERNALISER"]
["COAL","LA COTE ALPHA"]
["CODA","CODA MICRO AND BLOCK"]
["COMG","COMMERG LTD."]
["COMM","COMMERG"]
["CORE","ATD - CITIGROUP AGENCY OPTION AND EQUITIES ROUTING ENGINE"]
["COTC","BMO CAPITAL MARKETS - CAD OTC TRADES"]
["CPTX","CAPTIN"]
["CRED","CREDIT SUISSE (US)"]
["CREM","CREDEM BANCA - SYSTEMATIC INTERNALISER"]
["CRYD","CRYEX - FX AND DIGITAL CURRENCIES"]
["CRYP","CRYPTO FACILITIES"]
["CRYX","CRYEX"]
["CSAG","CREDIT SUISSE AG"]
["CSAU","CREDIT SUISSE EQUITIES (AUSTRALIA) LIMITED"]
["CSBX","CREDIT SUISSE AES EUROPE BENCHMARK CROSS"]
["CSCF","CREDIT SUISSE AES CROSSFINDER EUROPE"]
["CSEC","CITADEL SECURITIES FI - SYSTEMATIC INTERNALISER"]
["CSEU","CREDIT SUISSE (EUROPE)"]
["CSGI","CITADEL SECURITIES FI - EUROPE - SYSTEMATIC INTERNALISER"]
["CSHK","CREDIT SUISSE SECURITIES (HONG KONG) LIMITED"]
["CSIN","CREDIT SUISSE INTERNATIONAL"]
["CSJP","CREDIT SUISSE EQUITIES (JAPAN) LIMITED"]
["CSLB","CREDIT SUISSE AG - LONDON BRANCH"]
["CSLP","CREDIT SUISSE LIGHT POOL"]
["CSMD","CREDIT SUISSE SECURITIES SOCIEDAD DE VALORES, S.A."]
["CSOB","ČESKOSLOVENSKÁ OBCHODNÍ BANKA, A.S."]
["CSOT","CREDIT SUISSE AG - OHS"]
["CSSI","CREDIT SUISSE INTERNATIONAL - SYSTEMATIC INTERNALISER"]
["CSSX","CHINA STAINLESS STEEL EXCHANGE"]
["CSTO","NASDAQ CLEARING AB"]
["CSZH","CREDIT SUISSE (CH)"]
["CURX","CUREX FX"]
["CXAC","CHI-X MARKET AUSTRALIA - LIMIT VENUE"]
["CXAF","CHI-X AUSTRALIA MARKET PEG (FARPOINT) VENUE"]
["CXAM","CHI-X MOC"]
["CXAN","CHI-X AUSTRALIA PRIMARY PEG (NEARPOINT) VENUE"]
["CXAP","CHI-X AUSTRALIA MID-POINT VENUE"]
["CXAQ","CHI-X AUSTRALIA -QUOTED MANAGED FUNDS"]
["CXAR","CHI-X AUSTRALIA - TRANSFERABLE CUSTODY RECEIPT MARKET"]
["CXAV","CHI-X VWAP"]
["CXAW","CHI-X AUSTRALIA - WARRANTS"]
["CXOT","CREDITEX BROKERAGE LLP - OTF"]
["CXRT","CREDITEX BROKERAGE LLP - MTF"]
["DAIW","DAIWA CAPITAL MARKETS EUROPE LIMITED"]
["DAPA","DEUTSCHE BOERSE AG - APA SERVICE"]
["DASI","DANSKE BANK A/S - SYSTEMATIC INTERNALISER"]
["DAVY","J AND E DAVY - IRISH GOVERNMENT BOND - SYSTEMATIC INTERNALISER"]
["DBAG","DEUTSCHE BANK AG"]
["DBCR","DEUTSCHE BANK - CENTRAL RISK BOOK"]
["DBCX","DEUTSCHE BANK - CLOSE CROSS"]
["DBDC","DEUTSCHE BANK - DIRECT CAPITAL ACCESS"]
["DBES","DEUTSCHE BANK AG - SYSTEMATIC INTERNALISER"]
["DBHK","DEUTSCHE BANK HONG KONG ATS"]
["DBIX","DEUTSCHE BANK INTERNALISATION"]
["DBLN","DEUTSCHE BANK AG - LONDON - SYSTEMATIC INTERNALISER"]
["DBLX","DEUTSCHE BANK LUXEMBOURG S.A."]
["DBMO","DEUTSCHE BANK - MANUAL OTC"]
["DBOX","DEUTSCHE BANK OFF EXCHANGE TRADING"]
["DBSE","DEUTSCHE BANK - SUPERX EU"]
["DBSX","DEUTSCHE BANK SUPER X"]
["DCSE","NASDAQ COPENHAGEN A/S - NORDIC@MID"]
["DCSX","DUTCH CARIBBEAN SECURITIES EXCHANGE"]
["DDTX","DEAL DONE TRADING - SYSTEMATIC INTERNALISER"]
["DEAL","DCX (DERIVATIVES CURRENCY EXCHANGE)"]
["DEKA","DEKABANK DEUTSCHE GIROZENTRALE"]
["DGCX","DUBAI GOLD & COMMODITIES EXCHANGE DMCC"]
["DHEL","NASDAQ HELSINKI LTD - NORDIC@MID"]
["DHLX","DEUTSCHE HOLDINGS (LUXEMBOURG) S.A R.L."]
["DICE","NASDAQ ICELAND HF. - NORDIC@MID"]
["DIFX","NASDAQ DUBAI"]
["DKED","NASDAQ STOCKHOLM AB - DANISH EQ DERIVATIVES"]
["DKFI","NASDAQ STOCKHOLM AB - DANISH FI DERIVATIVES"]
["DKTC","DANSK OTC"]
["DNDK","FIRST NORTH DENMARK - NORDIC@MID"]
["DNFI","FIRST NORTH FINLAND - NORDIC@MID"]
["DNIS","FIRST NORTH ICELAND - NORDIC@MID"]
["DNSE","FIRST NORTH SWEDEN - NORDIC@MID"]
["DOSE","FIRST NORTH SWEDEN - NORWAY NORDIC@MID"]
["DOTS","SWISS DOTS BY CATS"]
["DOWG","DOWGATE"]
["DRCT","DAIWA DRECT"]
["DSMD","QATAR EXCHANGE"]
["DSME","FIRST NORTH DENMARK -SME GROWTH MARKET"]
["DSTO","NASDAQ STOCKHOLM AB - NORDIC@MID"]
["DUMX","DUBAI MERCANTILE EXCHANGE"]
["DUSA","BOERSE DUESSELDORF - REGULIERTER MARKT"]
["DUSB","BOERSE DUESSELDORF - FREIVERKEHR"]
["DUSC","BOERSE DUESSELDORF - QUOTRIX - REGULIERTER MARKT"]
["DUSD","BOERSE DUESSELDORF - QUOTRIX MTF"]
["DVFX","DIGITAL VEGA"]
["DWFI","DEALERWEB FIXED INCOME"]
["DWSF","DW SEF LLC"]
["DZBK","DZ BANK - SYSTEMATIC INTERNALISER"]
["EBMX","EBM - MTF"]
["EBON","NASDAQ STOCKHOLM AB - EUR FI DERIVATIVES"]
["EBRA","BRATISLAVA STOCK EXCHANGE-MTF"]
["EBSC","EBS MARKET- CLOB - FOR THE TRADING OF SPOT FX, PRECIOUS METALS AND OTHER FX PRODUCTS"]
["EBSD","EBS MTF - RFQ - FOR THE TRADING OF FX PRODUCTS"]
["EBSI","EBS MTF - RFQ - FOR ASSET MANAGERS TRADING FX PRODUCTS"]
["EBSM","EBS MTF - CLOB - FOR THE TRADING OF FX PRODUCTS"]
["EBSN","EBS MTF"]
["EBSS","EBS SERVICE COMPANY LIMITED - ALL MARKETS"]
["ECAG","EUREX CLEARING AG"]
["ECAL","EUREX CLEARING ASIA PTE. LTD."]
["ECEU","TRADECHO EU APA"]
["ECHO","LONDON STOCK EXCHANGE - APA"]
["ECSL","ENTERPRISE COMMODITY SERVICES LIMITED"]
["EDDP","CBOE EDGX U.S. EQUITIES EXCHANGE DARK"]
["EDGA","CBOE EDGA U.S. EQUITIES EXCHANGE"]
["EDGD","CBOE EDGA U.S. EQUITIES EXCHANGE DARK"]
["EDGO","CBOE EDGX OPTIONS EXCHANGE"]
["EDGX","CBOE EDGX U.S. EQUITIES EXCHANGE"]
["EDRF","EDMOND DE ROTHSCHILD  (FRANCE) - SYSTEMATIC INTERNALISER"]
["EEAL","EUREX EXCHANGE ASIA PTE. LTD."]
["EESE","EAST EUROPEAN STOCK EXCHANGE"]
["EGMT","EG MARKET TECHNOLOGIES"]
["EGSI","ERSTE GROUP BANK AG"]
["ELEU","NASDAQ COMMODITIES - EUR POWER/ENERGY"]
["ELIX","ELIXIUM"]
["ELNO","NASDAQ COMMODITIES - NOK POWER/ENERGY"]
["ELSE","NASDAQ COMMODITIES - SEK POWER/ENERGY"]
["ELUK","NASDAQ COMMODITIES - GBP POWER/ENERGY"]
["ELXE","ELIXIUM S.A."]
["EMBX","EMERGING MARKETS BOND EXCHANGE LIMITED"]
["EMDR","E-MID - E-MIDER MARKET"]
["EMIB","E-MID - BANCA D'ITALIA SHARES TRADING MARKET"]
["EMID","E-MID"]
["EMIR","E-MID REPO"]
["EMLD","MIAX EMERALD, LLC"]
["EMTF","EURO MTF"]
["EMTS","EBM"]
["ENAX","ATHENS EXCHANGE ALTERNATIVE MARKET"]
["ENCL","ENCLEAR"]
["ENSY","EURONEXT SYNAPSE"]
["ENXL","EURONEXT ACCESS LISBON"]
["EOTC","E-OTC"]
["EPEX","EPEX SPOT SE"]
["EQIE","EQUILEND LIMITED"]
["EQLD","EQUILEND EUROPE LIMITED"]
["EQTA","BOERSE BERLIN EQUIDUCT TRADING - REGULIERTER MARKT"]
["EQTB","BOERSE BERLIN EQUIDUCT TRADING - BERLIN SECOND REGULATED MARKET"]
["EQTC","BOERSE BERLIN EQUIDUCT TRADING - FREIVERKEHR"]
["EQTD","BOERSE BERLIN EQUIDUCT TRADING - OTC"]
["ERIS","ERIS EXCHANGE"]
["ERST","ERSTE BEFEKTETESI ZRT - SYSTEMATIC INTERNALISER"]
["ESTO","NASDAQ STOCKHOLM AB – NORWAY ETF"]
["ETFP","ELECTRONIC ETF, ETC/ETN AND OPEN-END FUNDS MARKET"]
["ETLX","EUROTLX"]
["ETPA","ENERGY TRADING PLATFORM AMSTERDAM"]
["ETSC","ETS EURASIAN TRADING SYSTEM COMMODITY EXCHANGE"]
["EUCC","CITADEL CONNECT EUROPE - EU - SYSTEMATIC INTERNALISER"]
["EUCH","EUREX ZURICH"]
["EURM","EUREX REPO MARKET"]
["EUSC","EUREX CH SECLEND MARKET"]
["EUSP","EUREX OTC SPOT MARKET"]
["EUWA","EUWAX AG - SYSTEMATIC INTERNALISER"]
["EUWB","NASDAQ STOCKHOLM AB - EUR WB EQ DERIVATIVES"]
["EUWX","EUWAX"]
["EWSM","EUROPEAN WHOLESALE SECURITIES MARKET"]
["EXAA","WIENER BOERSE AG, AUSTRIAN ENERGY EXCHANGE"]
["EXBO","EXANE BNP PARIBAS - BID-OFFER CROSSING"]
["EXCP","EXANE BNP PARIBAS - CLOSING PRICE"]
["EXDC","EXANE BNP PARIBAS - DIRECT CAPITAL ACCESS"]
["EXEU","EXANE BNP PARIBAS"]
["EXLP","EXANE BNP PARIBAS - LIQUIDITY PROVISION"]
["EXMP","EXANE BNP PARIBAS - MID POINT"]
["EXOR","EXANE BNP PARIBAS - CHILD ORDER CROSSING"]
["EXOT","EXOTIX CAPITAL  - OTF"]
["EXSB","EXANE DERIVATIVES - SYSTEMATIC INTERNALISER CORPORATE BONDS"]
["EXSD","EXANE DERIVATIVES - SYSTEMATIC INTERNALISER OTC DERIVATIVES"]
["EXSE","EXANE BNP PARIBAS - SYSTEMATIC INTERNALISER"]
["EXSF","EXANE DERIVATIVES - SYSTEMATIC INTERNALISER OTHER BONDS"]
["EXSH","EXANE DERIVATIVES - SYSTEMATIC INTERNALISER SHARES"]
["EXSI","EXANE BNP PARIBAS - GB - SYSTEMATIC INTERNALISER"]
["EXSP","EXANE DERIVATIVES - SYSTEMATIC INTERNALISER STRUCTURED PRODUCTS"]
["EXSY","EXANE DERIVATIVES - SYSTEMATIC INTERNALISER"]
["EXTR","ENERGY EXCHANGE ISTANBUL"]
["EXVP","EXANE BNP PARIBAS - VOLUME PROFILE CROSSING"]
["EXYY","EXANE DERIVATIVES - SYSTEMATIC INTERNALISER CONVERTIBLES"]
["FAIR","CANTOR SPREADFAIR"]
["FAST","FASTMATCH"]
["FBSI","FINECO BANK - SYSTEMATIC INTERNALISER"]
["FCBT","CHICAGO BOARD OF TRADE (FLOOR)"]
["FCME","CHICAGO MERCANTILE EXCHANGE (FLOOR)"]
["FGEX","KAASUPORSSI - FINNISH GAS EXCHANGE"]
["FICO","FINANCIALCONTENT"]
["FICX","FINANCIAL INFORMATION CONTRIBUTORS EXCHANGE"]
["FIED","NASDAQ STOCKHOLM AB - FINNISH EQ DERIVATIVES"]
["FINC","FINRA/NASDAQ TRF CHICAGO (TRADE REPORTING FACILITY)"]
["FINN","FINRA/NASDAQ TRF CARTERET (TRADE REPORTING FACILITY)"]
["FINO","FINRA ORF (TRADE REPORTING FACILITY)"]
["FINR","FINRA"]
["FINY","FINRA/NYSE TRF (TRADE REPORTING FACILITY)"]
["FISH","FISH POOL ASA"]
["FISU","FREIGHT INVESTOR SERVICES LIMITED"]
["FLTR","FLOW TRADERS - SYSTEMATIC INTERNALISER"]
["FLWX","FLOW TRADERS"]
["FMTS","MTS FRANCE SAS"]
["FNCS","FENICS - US TREASURIES"]
["FNDK","FIRST NORTH DENMARK"]
["FNEE","FIRST NORTH ESTONIA"]
["FNFI","FIRST NORTH FINLAND"]
["FNIS","FIRST NORTH ICELAND"]
["FNLT","FIRST NORTH LITHUANIA"]
["FNLV","FIRST NORTH LATVIA"]
["FNSE","FIRST NORTH SWEDEN"]
["FRAA","BOERSE FRANKFURT - REGULIERTER MARKT"]
["FRAB","BOERSE FRANKFURT - FREIVERKEHR"]
["FRAS","BOERSE FRANKFURT - SCALE"]
["FREI","NASDAQ COMMODITIES - FREIGHT COMMODITY"]
["FRTE","FORTE  - OTF"]
["FSEF","FTSEF LLC"]
["FSHX","FISHEX"]
["FSME","FIRST NORTH FINLAND - SME GROWTH MARKET"]
["FTFM","42 FINANCIAL SERVICES - MTF"]
["FTFS","42 FINANCIAL SERVICES"]
["FXAL","FXALL"]
["FXCL","CLEARCORP DEALING SYSTEMS INDIA LIMITED – FX-CLEAR"]
["FXCM","FXCM"]
["FXFM","FINANCIAL AND RISK TRANSACTIONS SERVICES IRELAND LIMITED - FORWARDS MATCHING"]
["FXGB","FXCM - MTF"]
["FXOP","TRADITION-NEX OTF"]
["FXRQ","FINANCIAL AND RISK TRANSACTIONS SERVICES IRELAND LIMITED - FXALL RFQ MTF"]
["FXSW","CLEARCORP DEALING SYSTEMS INDIA LIMITED – FX-SWAP"]
["G1XX","G1 EXECUTION SERVICES"]
["GBOT","BOURSE AFRICA LIMITED"]
["GBUL","BULGARIAN STOCK EXCHANGE - SME GROWTH MARKET BEAM"]
["GBWB","NASDAQ STOCKHOLM AB – GBP WB EQ DERIVATIVES"]
["GEMX","GEMMA (GILT EDGED MARKET MAKERS’ASSOCIATION)"]
["GETB","LITHUANIAN NATURAL GAS EXCHANGE"]
["GFBM","GFI BROKERS - MTF"]
["GFBO","GFI BROKERS - OTF"]
["GFIB","GFI BROKERS"]
["GFIC","GFI SECURITIES LTD"]
["GFIF","GFI FOREXMATCH"]
["GFIN","GFI ENERGYMATCH"]
["GFIR","GFI RATESMATCH"]
["GFKS","GARANTUM FONDKOMMISSION AB - SYSTEMATIC INTERNALISER"]
["GFSM","GFI SECURITIES LTD - MTF"]
["GFSO","GFI SECURITIES LTD - OTF"]
["GIPB","GOLDMAN SACHS INTERNATIONAL PARIS BRANCH"]
["GLBX","CME GLOBEX"]
["GLLC","GATE US LLC"]
["GLMX","GLMX"]
["GLPS","ESSEX RADEZ, LLC"]
["GLPX","ACS EXECUTION SERVICES, LLC"]
["GMEG","GMEX EXCHANGE"]
["GMEO","GRIFFIN MARKETS EUROPE - OTF"]
["GMES","GRIFFIN MARKETS EUROPE"]
["GMGD","GMG DUBAI LIMITED"]
["GMGL","GMG BROKERS LIMITED"]
["GMNI","ISE GEMINI EXCHANGE"]
["GMTF","GALAXY"]
["GMTS","MTS GERMANY"]
["GOTC","GLOBAL OTC"]
["GOVX","GOVEX"]
["GPBC","GPB-FINANCIAL SERVICES LTD - SYSTEMATIC INTERNALISER"]
["GREE","THE GREEN EXCHANGE"]
["GRIF","GRIFFIN MARKETS LIMITED"]
["GRIO","GRIFFIN MARKETS LIMITED - OTF"]
["GRSE","THE GREEN STOCK EXCHANGE - ACB IMPACT MARKETS"]
["GSAL","GOLDMAN SACHS (ASIA) LLC"]
["GSBE","GOLDMAN SACHS BANK EUROPE SE"]
["GSBX","GOLDMAN SACHS INTERNATIONAL - SIGMA BCN"]
["GSCI","THE GUYANA ASSOCIATION OF SECURITIES COMPANIES AND INTERMEDIARIES INC."]
["GSCO","GOLDMAN SACHS AND CO."]
["GSEF","GFI SWAPS EXCHANGE, LLC"]
["GSEI","GOLDMAN SACHS BANK EUROPE SE - SYSTEMATIC INTERNALISER"]
["GSIB","GOLDMAN SACHS INTERNATIONAL BANK"]
["GSIL","GOLDMAN SACHS INTERNATIONAL"]
["GSPX","GOLDMAN SACHS INTERNATIONAL PARIS BRANCH - SYSTEMATIC INTERNALISER"]
["GSSI","GOLDMAN SACHS INTERNATIONAL - SYSTEMATIC INTERNALISER"]
["GSXH","GSX HONG KONG"]
["GSXL","THE GIBRALTAR STOCK EXCHANGE"]
["GTCO","KCG AMERICAS LLC"]
["GTSX","GTSX"]
["GTXE","GTX ECN"]
["GTXS","GTX SEF, LLC"]
["GXGF","GXG MTF FIRST QUOTE"]
["GXGM","GXG MTF"]
["GXGR","GXG MARKETS A/S"]
["GXMA","GX MARKETCENTER"]
["HAMA","BOERSE HAMBURG - REGULIERTER MARKT"]
["HAMB","BOERSE HAMBURG - FREIVERKEHR"]
["HAML","BOERSE HAMBURG - LANG AND SCHWARZ EXCHANGE"]
["HAMM","BOERSE HAMBURG - LANG AND SCHWARZ EXCHANGE - REGULIERTER MARKT"]
["HAMN","BOERSE HAMBURG - LANG AND SCHWARZ EXCHANGE - FREIVERKEHR"]
["HANA","BOERSE HANNOVER - REGULIERTER MARKT"]
["HANB","BOERSE HANNOVER - FREIVERKEHR"]
["HBFR","HSBC FRANCE - SYSTEMATIC INTERNALISER"]
["HBPL","HSBC BANK POLSKA S.A. - SYSTEMATIC INTERNALISER"]
["HCHC","ICE CLEAR NETHERLANDS B.V."]
["HDAT","ELECTRONIC SECONDARY SECURITIES MARKET (HDAT)"]
["HEGX","NADEX"]
["HELA","HELABA - SYSTEMATIC INTERNALISER"]
["HEMO","HENEX S.A."]
["HMOD","HI-MTF ORDER DRIVEN"]
["HMTF","HI-MTF"]
["HOTC","HELLENIC EXCHANGE OTC MARKET"]
["HPCO","HPC SA - SWAPTIONS"]
["HPCS","HPC SA - COMMODITIES"]
["HPCV","HPC SA - VOICE OTF"]
["HPCX","HPC SA"]
["HPPO","POTAMUS TRADING LLC"]
["HREU","HRTEU LIMITED - SYSTEMATIC INTERNALISER"]
["HRFQ","HI-MTF RFQ"]
["HRSI","HUDSON RIVER TRADING - SYSTEMATIC INTERNALISER"]
["HRTF","HUDSON RIVER TRADING (HRT)"]
["HRTX","HUDSON RIVER TRADING"]
["HSBC","HSBC - SYSTEMATIC INTERNALISER"]
["HSBT","HSBC TRINKAUS AND BURKHARDT AG - SYSTEMATIC INTERNALISER"]
["HSFX","HOTSPOT FX"]
["HSTC","HANOI STOCK EXCHANGE"]
["HSXA","HSBC-X HONG KONG"]
["HUDX","HUNGARIAN DERIVATIVE ENERGY EXCHANGE"]
["HUNG","MTS HUNGARY"]
["HUPX","HUNGARIAN POWER EXCHANGE"]
["IATS","INTERACTIVE BROKERS LLC - ATS"]
["IBAL","ICE BENCHMARK ADMINISTRATION"]
["IBEQ","INVEST BANCA - IBIS EQUITY - SYSTEMATIC INTERNALISER"]
["IBEX","INDEPENDENT BULGARIAN ENERGY EXCHANGE"]
["IBGH","IBERIAN GAS HUB"]
["IBIS","INVEST BANCA - SYSTEMATIC INTERNALISER"]
["IBUL","BULGARIAN STOCK EXCHANGE - INTERNATIONAL INSTRUMENTS"]
["ICBX","INSTINET CBX (US)"]
["ICDX","INDONESIA COMMODITY AND DERIVATIVES EXCHANGE"]
["ICEL","ISLAND ECN LTD, THE"]
["ICEO","ICAP ENERGY - OTF"]
["ICES","ICE SWAP TRADE LLC"]
["ICOT","ICAP EU - OTF"]
["ICPM","TP ICAP UK MTF"]
["ICRO","INSTINET VWAP CROSS"]
["ICSU","ICAP SEF (US)  LLC."]
["ICUR","CURRENEX IRELAND MTF"]
["ICXL","INDIAN COMMODITY EXCHANGE LTD."]
["ICXR","CURRENEX IRELAND MTF - RFQ"]
["IECL","ICAP ENERGY LTD OTF - COMMODITIES AND ENERGY DERIVATIVES"]
["IEPA","INTERCONTINENTAL EXCHANGE"]
["IEXD","INVESTORS EXCHANGE - DARK"]
["IEXG","INVESTORS EXCHANGE"]
["IFCA","ICE FUTURES CANADA"]
["IFED","ICE FUTURES U.S. ENERGY DIVISION"]
["IFEN","ICE FUTURES EUROPE - OIL AND REFINED PRODUCTS DIVISION"]
["IFEU","ICE FUTURES EUROPE"]
["IFLL","ICE FUTURES EUROPE - FINANCIAL PRODUCTS DIVISION"]
["IFLO","ICE FUTURES EUROPE - EQUITY PRODUCTS DIVISION"]
["IFLS","SWAPXECUTE"]
["IFLX","ICE FUTURES EUROPE - AGRICULTURAL PRODUCTS DIVISION"]
["IFSG","ICE FUTURES SINGAPORE"]
["IFSM","INSTITUTIONAL FINANCIAL SECURITIES MARKET"]
["IFUS","ICE FUTURES U.S."]
["IFUT","ICE FUTURES EUROPE - EUROPEAN UTILITIES DIVISION"]
["IFXA","FX CONNECT IRELAND MTF - ALLOCATIONS"]
["IFXC","FX CONNECT IRELAND MTF"]
["IFXR","FX CONNECT IRELAND MTF - RFQ"]
["IGDL","ICAP GLOBAL DERIVATIVES LIMITED"]
["IINX","INDIA INTERNATIONAL EXCHANGE (IFSC) LIMITED"]
["IKBS","IKB DEUTSCHE INDUSTRIEBANK AG - SYSTEMATIC INTERNALISER"]
["IMAG","ICE MARKETS AGRICULTURE"]
["IMBD","ICE MARKETS BONDS"]
["IMCC","CREDITEX SECURITIES CORPORATION"]
["IMCE","TP ICAP UK MTF - CASH EQUITY"]
["IMCG","CREDITEX LLC"]
["IMCO","ICE ENDEX OTF FUTURES"]
["IMCR","ICE MARKETS CREDIT"]
["IMCS","IMC FINANCIAL MARKETS"]
["IMCT","IMC - SYSTEMATIC INTERNALISER"]
["IMED","TP ICAP UK MTF - EQUITY DERIVATIVES"]
["IMEN","ICE MARKETS ENERGY"]
["IMEQ","ICE MARKETS EQUITY"]
["IMET","TP ICAP UK MTF - EXCHANGE TRADED PRODUCTS"]
["IMEX","IRAN MERCANTILE EXCHANGE"]
["IMFD","TP ICAP UK MTF - FX DERIVATIVES"]
["IMFX","ICE MARKETS FOREIGN EXCHANGE"]
["IMGB","TP ICAP UK MTF - GOVERNMENT BONDS EXCLUDING GILTS"]
["IMGI","TP ICAP UK MTF - GILTS"]
["IMIR","ICE MARKETS RATES"]
["IMMH","IMMH – BANCA IMI - SYSTEMATIC INTERNALISER"]
["IMMM","TP ICAP UK MTF - MONEY MARKET INSTRUMENTS"]
["IMRD","TP ICAP UK MTF - INTEREST RATE DERIVATIVES"]
["IMSB","TP ICAP UK MTF - CORPORATE BONDS AND SECURITIES DEBT"]
["IMTF","INTEGRAL MTF"]
["IMTS","MTS IRELAND"]
["INCA","INSTINET DESK CROSS"]
["INCR","INTELLIGENTCROSS"]
["INGB","ING BANK NV - SYSTEMATIC INTERNALISER"]
["INGE","ING BANK NV - SPRINTERS AND EQUITY - SYSTEMATIC INTERNALISER"]
["INGF","ING BANK NV - FOREIGN EXCHANGE - SYSTEMATIC INTERNALISER"]
["INGW","ING BANK SLASKI SA - SYSTEMATIC INTERNALISER"]
["INSE","NSE IFSC LIMITED"]
["INVE","INVESTEC BANK PLC - SYSTEMATIC INTERNALISER"]
["IOCD","ICAP SECURITIES OTF - CREDIT DERIVATIVES"]
["IOED","ICAP SECURITIES OTF - EQUITY DERIVATIVES"]
["IOFI","ICAP SECURITIES OTF - CORPORATE BONDS AND SECURITISED DEBT"]
["IOFX","ICAP SECURITIES OTF - FX DERIVATIVES"]
["IOGB","ICAP SECURITIES OTF - GOVERNMENT BONDS EXCLUDING  UK GILTS"]
["IOGI","ICAP SECURITIES OTF - GOVERNMENT BONDS - UK GILTS"]
["IOIR","ICAP SECURITIES OTF - INTEREST RATE DERIVATIVES"]
["IOMM","ICAP SECURITIES OTF - MONEY MARKET INSTRUMENTS"]
["IOTC","INSTINET EUROPE LIMITED OTC"]
["IOTF","ICAP SECURITIES - OTF"]
["IPSX","IPSX"]
["IPXP","IPSX PRIME"]
["ISBA","BANCA DI ASTI - SYSTEMATIC INTERNALISER"]
["ISBV","BIVER BANCA - SYSTEMATIC INTERNALISER"]
["ISDA","ISDAFIX"]
["ISEX","INTER-CONNECTED STOCK EXCHANGE OF INDIA LTD"]
["ISSI","ICBC STANDARD BANK - SYSTEMATIC INTERNALISER"]
["ISWA","I-SWAP"]
["ISWB","I-SWAP - TRADE REGISTRATION"]
["ISWC","I-SWAP ORDER BOOK"]
["ISWE","ICAP GLOBAL DERIVATIVES LIMITED - ELECTRONIC"]
["ISWN","ISWAP EURO MTF - TRADE REGISTRATION"]
["ISWO","ISWAP EURO MTF - ORDERBOOK"]
["ISWP","ISWAP EURO MTF"]
["ISWR","I-SWAP TARGETED STREAMING/RFQ"]
["ISWT","ISWAP EURO MTF - TARGETED STREAMING / RFQ"]
["ISWV","ICAP GLOBAL DERIVATIVES LIMITED - VOICE"]
["ITGI","ITG - POSIT"]
["ITGL","ITG - POSIT MTF"]
["IVZX","INVESCO CANADA PTF TRADES"]
["JADX","JOINT ASIAN DERIVATIVES EXCHANGE"]
["JBSI","JYSKE BANK - SYSTEMATIC INTERNALISER"]
["JBUL","BULGARIAN STOCK EXCHANGE - INTERNATIONAL MTF"]
["JEFE","JEFFERIES EUROPE"]
["JEFS","JEFFERIES INTERNATIONAL - SYSTEMATIC INTERNALISER"]
["JEFX","JETX"]
["JESI","JEFFERIES EUROPE - SYSTEMATIC INTERNALISER"]
["JISI","JEFFERIES INTERNATIONAL"]
["JLEU","JUMP TRADING EUROPE - SYSTEMATIC INTERNALISER"]
["JLQD","JUMP LIQUIDITY"]
["JLSI","JUMP LIQUIDITY - SYSTEMATIC INTERNALISER"]
["JPBX","JPBX"]
["JPCB","JPMORGAN CHASE BANK N.A. LONDON BRANCH"]
["JPEU","J.P. MORGAN AG - SYSTEMATIC INTERNALISER"]
["JPMI","JP MORGAN - JPMI MARKET"]
["JPMX","JPMX"]
["JPSI","J.P. MORGAN SECURITIES PLC"]
["JSEB","JSE BOND ELECTRONIC TRADING PLATFORM"]
["JSES","JANE STREET EXECUTION SERVICES LLC"]
["JSJX","JANE STREET JX"]
["JSSI","JANE STREET FINANCIAL LTD - SYSTEMATIC INTERNALISER"]
["JYSI","DEN JYSKE SPAREKASSE - SYSTEMATIC INTERNALISER"]
["KAIX","KAI-X"]
["KBCB","KBC BANK NV  GROUP MARKETS - SYSTEMATIC INTERNALISER"]
["KBLC","KBL EURO COMMERCIAL PAPERS"]
["KBLL","KBL EUROPEAN PRIVATE BANKERS S.A."]
["KBLM","KYTE BROKING LIMITED"]
["KBLS","KBL STRUCTURED PRODUCTS"]
["KBLT","KBL FX TREASURY DERIVATIVES"]
["KCCP","KELER CCP"]
["KELR","KELER"]
["KHHU","K AND H BANK ZRT - SYSTEMATIC INTERNALISER"]
["KLEU","KNIGHT LINK EUROPE"]
["KMUX","ZURCHER KANTONALBANK - EKMU-X"]
["KNCM","KNIGHT CAPITAL MARKETS LLC"]
["KNEM","KNIGHT EQUITY MARKETS LP"]
["KNIG","KNIGHT"]
["KNLI","KNIGHT LINK"]
["KNMX","KNIGHT MATCH ATS"]
["KOTF","OTFLINK"]
["LASF","LATAM SEF"]
["LASP","LAN AND SPAR BANK A/S"]
["LBBW","LBBW - LANDESBANK BADEN-WUERTTEMBERG"]
["LBCM","LLOYDS BANK CORPORATE MARKETS – SYSTEMATIC INTERNALISER"]
["LBCW","LLOYDS BANK CORPORATE MARKETS WERTPAPIERHANDELSBANK GMBH - SYSTEMATIC INTERNALISER"]
["LBWL","LBBW - LANDESBANK BADEN-WUERTTEMBERG - LIQUIDITY PROVIDER"]
["LBWS","LBBW - LANDESBANK BADEN-WUERTTEMBERG - SYSTEMATIC INTERNALISER"]
["LCHC","LCH.CLEARNET"]
["LCUR","CURRENEX LDFX"]
["LEDG","LEDGERX"]
["LEUE","LIQUIDNET EU LIMITED EQUITY MTF"]
["LEUF","LIQUIDNET EU LIMITED FIXED INCOME MTF"]
["LEVL","LEVEL ATS"]
["LICA","LIQUIDNET CANADA ATS"]
["LIFI","LIQUIDNET, INC. FIXED INCOME ATS"]
["LIGA","LIGA BANK EG - SYSTEMATIC INTERNALISER"]
["LIQF","LIQUIDNET EUROPE LIMITED"]
["LIQH","LIQUIDNET H20"]
["LIQU","LIQUIDNET SYSTEMS"]
["LISX","CBOE  EUROPE - LIS SERVICE"]
["LISZ","CBOE EUROPE - LIS SERVICE (NL)"]
["LIUH","LIQUIDNET, INC. H2O ATS"]
["LIUS","LIQUIDNET, INC."]
["LMAD","LMAX - DERIVATIVES"]
["LMAE","LMAX - EQUITIES"]
["LMAF","LMAX - FX"]
["LMAO","LMAX - INDICES/RATES/COMMODITIES"]
["LMAX","LMAX"]
["LMEC","LME CLEAR"]
["LMNR","LUMINOR BANK - SYSTEMATIC INTERNALISER"]
["LMNX","LUMINEX TRADING & ANALYTICS LLC - ATS"]
["LOTC","OTC MARKET"]
["LOUI","LOUIS CAPITAL MARKETS UK LLP"]
["LOYD","LLOYDS BANK - SYSTEMATIC INTERNALISER"]
["LPPM","LONDON PLATINUM AND PALLADIUM MARKET"]
["LQED","LIQUIDITYEDGE"]
["LQFI","CITI LIQUIFI"]
["LSSI","LANG AND SCHWARZ TRADE CENTER - SYSTEMATIC INTERNALISER"]
["LTAA","LUMINEX TRADING & ANALYTICS LLC"]
["LXJP","BARCLAYS LX JAPAN"]
["LYNX","LYNX ATS"]
["MABX","MERCADO ALTERNATIVO BURSATIL"]
["MACB","MACQUARIE AUSTRALIA BLOCK CROSSING"]
["MAEL","MARKETAXESS EUROPE LIMITED"]
["MAGM","MAGMA ATS"]
["MAKX","MAKOR SECURITIES LONDON LTD"]
["MALX","MALDIVES STOCK EXCHANGE"]
["MANL","MARKETAXESS NL B.V."]
["MAQE","MBE OPERATING COMPANY DESIGNATED ACTIVITY COMPANY - SYSTEMATIC INTERNALISER"]
["MAQH","MACQUARIE INTERNAL MARKETS (HONG KONG)"]
["MAQI","MACQUARIE BANK INTERNATIONAL LIMITED - SYSTEMATIC INTERNALISER"]
["MAQJ","MACQUARIE INTERNAL MARKETS (JAPAN)"]
["MAQL","MACQUARIE CAPITAL EUROPE LIMITED"]
["MAQU","MACQUARIE BANK LIMITED, LONDON BRANCH - SYSTEMATIC INTERNALISER"]
["MAQX","MACQUARIE INTERNAL MARKETS (AUSTRALIA)"]
["MARF","MERCADO ALTERNATIVO DE RENTA FIJA"]
["MASG","MARKETAXESS SINGAPORE PTE LIMITED"]
["MATN","MATCH NOW"]
["MBPL","MBANK S.A. - SYSTEMATIC INTERNALISER"]
["MBUL","MTF SOFIA"]
["MCAD","MTS CASH DOMESTIC - MTF"]
["MCID","MACQUARIE CAPITAL (IRELAND)"]
["MCRY","ISE MERCURY, LLC"]
["MCSE","NASDAQ COPENHAGEN A/S – AUCTION ON DEMAND"]
["MCUR","CURRENEX MTF"]
["MCXR","CURRENEX MTF - RFQ"]
["MCXS","CURRENEX MTF - STREAMING"]
["MCXX","MCX STOCK EXCHANGE LTD"]
["MCZK","MTS CZECH REPUBLIC"]
["MDRV","MIBGAS - DERIVATIVES"]
["MELO","NASDAQ MIDPOINT-ELO (M-ELO)"]
["MERD","MERKUR MARKET - DARK POOL"]
["MERF","MERCADO ELECTRONICO DE RENTA FIJA"]
["MERK","MERKUR MARKET"]
["MESI","MORGAN STANLEY EUROPE S.E. - SYSTEMATIC INTERNALISER"]
["MESQ","ACE MARKET"]
["METZ","MET ZURICH"]
["MFGL","MF GLOBAL ENERGY MTF"]
["MFOX","EURONEXT - MERCADO DE FUTUROS E OPÇÕES"]
["MFXA","FX CONNECT - MTF - ALLOCATIONS"]
["MFXC","FX CONNECT - MTF"]
["MFXR","FX CONNECT - MTF - RFQ"]
["MHBD","MIZUHO BANK, LTD. DUESSELDORF BRANCH - SYSTEMATIC INTERNALISER"]
["MHBE","MIZUHO BANK EUROPE N.V. - SYSTEMATIC INTERNALISER"]
["MHBL","MIZUHO BANK, LTD. LONDON BRANCH - SYSTEMATIC INTERNALISER"]
["MHBP","MIZUHO BANK LTD. - PARIS BRANCH - SYSTEMATIC INTERNALISER"]
["MHEL","NASDAQ HELSINKI LTD –  AUCTION ON DEMAND"]
["MHEU","MIZUHO SECURITIES EUROPE - SYSTEMATIC INTERNALISER"]
["MHIP","MIZUHO INTERNATIONAL - SYSTEMATIC INTERNALISER"]
["MIBG","MERCADO ORGANIZADO DEL GAS"]
["MICE","NASDAQ ICELAND HF. – AUCTION ON DEMAND"]
["MIHI","MIAMI INTERNATIONAL HOLDINGS, INC."]
["MISX","MOSCOW EXCHANGE - ALL MARKETS"]
["MIVX","MARKET FOR INVESTMENT VEHICLES"]
["MIZX","MIZUHO INTERNAL CROSSING"]
["MKAP","MERITKAPITAL - SYSTEMATIC INTERNALISER"]
["MLCO","BANK OF AMERICA - MERRILL LYNCH OTC"]
["MLER","BOFA SECURITIES EUROPE - RFQ - SYSTEMATIC INTERNALISER"]
["MLES","BOFA SECURITIES EUROPE - SYSTEMATIC INTERNALISER"]
["MLEX","BOFA SECURITIES EUROPE"]
["MLIX","MERRILL LYNCH INTERNATIONAL"]
["MLRQ","MERRILL LYNCH INTERNATIONAL - RFQ - SYSTEMATIC INTERNALISER"]
["MLSI","MERRILL LYNCH INTERNATIONAL - SYSTEMATIC INTERNALISER"]
["MLVX","BANK OF AMERICA - MERRILL LYNCH VWAP CROSS"]
["MLXB","EURONEXT ACCESS BRUSSELS"]
["MNDK","FIRST NORTH DENMARK – AUCTION ON DEMAND"]
["MNFI","FIRST NORTH FINLAND – AUCTION ON DEMAND"]
["MNIS","FIRST NORTH ICELAND – AUCTION ON DEMAND"]
["MNSE","FIRST NORTH SWEDEN – AUCTION ON DEMAND"]
["MOCX","MOC CROSS"]
["MOSE","FIRST NORTH SWEDEN - NORWAY AUCTION ON DEMAND"]
["MOTX","ELECTRONIC BOND MARKET"]
["MPRL","MIAX PEARL, LLC"]
["MSAL","MORGAN STANLEY AUSTRALIA SECURITIES LIMITED"]
["MSAX","MORGAN STANLEY MTF - PERIODIC AUCTION"]
["MSCO","MORGAN STANLEY AND CO. LLC"]
["MSCX","MORGAN STANLEY MTF - CONTINUOUS CROSS DARK"]
["MSEL","MAREX SPECTRON EUROPE LIMITED - OTF"]
["MSEU","MORGAN STANLEY EUROPE S.E."]
["MSIP","MORGAN STANLEY AND CO. INTERNATIONAL PLC"]
["MSMS","MORGAN STANLEY MUFG SECURITIES CO., LTD"]
["MSNT","MORGAN STANLEY MTF - NEGOTIATED TRADE"]
["MSPL","MS POOL"]
["MSRP","MS RPOOL"]
["MSSI","MORGAN STANLEY AND CO. INTERNATIONAL PLC - SYSTEMATIC INTERNALISER"]
["MSTO","NASDAQ STOCKHOLM AB – AUCTION ON DEMAND"]
["MSTX","MS TRAJECTORY CROSS"]
["MTAA","ELECTRONIC SHARE MARKET"]
["MTAH","BORSA ITALIANA EQUITY MTF"]
["MTCH","BONDMATCH"]
["MTSA","MTS AUSTRIA"]
["MTSB","MTS BONDS.COM"]
["MTSC","MTS ITALIA"]
["MTSD","MTS DENMARK"]
["MTSF","MTS FINLAND"]
["MTSG","MTS GREECE"]
["MTSO","MTS S.P.A."]
["MTUS","MTS MARKETS INTERNATIONAL INC."]
["MTXA","MARKETAXESS CANADA COMPANY"]
["MTXC","MARKETAXESS CORPORATION SINGLE-NAME CDS CENTRAL LIMIT ORDER"]
["MTXM","MARKETAXESS CORPORATION MID-X TRADING SYSTEM"]
["MTXS","MARKETAXESS SEF CORPORATION"]
["MTXX","MARKETAXESS CORPORATION"]
["MUBE","MUFG BANK (EUROPE) N.V. - SYSTEMATIC INTERNALISER"]
["MUBL","MUFG BANK, LTD. - LONDON BRANCH -SYSTEMATIC INTERNALISER"]
["MUBM","MUFG BANK, LTD. - MILANO BRANCH - SYSTEMATIC INTERNALISER"]
["MUBP","MUFG BANK, LTD. - PARIS BRANCH - SYSTEMATIC INTERNALISER"]
["MUFP","MARIANA UFP LLP"]
["MUNA","BOERSE MUENCHEN - REGULIERTER MARKT"]
["MUNB","BOERSE MUENCHEN - FREIVERKEHR"]
["MUNC","BOERSE MUENCHEN - GETTEX - REGULIERTER MARKT"]
["MUND","BOERSE MUENCHEN – GETTEX – FREIVERKEHR"]
["MUSE","MUFG SECURITIES EMEA PLC - SYSTEMATIC INTERNALISER"]
["MUSN","MUFG SECURITIES (EUROPE) N.V -"]
["MUTI","MITSUBISHI UFJ TRUST INTERNATIONAL LIMITED"]
["MVCX","MERCADO DE VALORES DE CORDOBA S.A."]
["MYTR","MYTREASURY"]
["N2EX","N2EX"]
["NABA","NATIONAL AUSTRALIA BANK - FX DERIVATIVES AND FIXED INCOME SECURITIES - SYSTEMATIC INTERNALISER"]
["NABE","NAB EUROPE LIMITED - SYSTEMATIC INTERNALISER"]
["NABL","NATIONAL AUSTRALIA BANK - SYSTEMATIC INTERNALISER"]
["NABU","NAB EUROPE LIMITED - SYSTEMATIC INTERNALISER - FIXED INCOME SECURITIES"]
["NAMX","NATIONAL MERCANTILE EXCHANGE"]
["NAPA","NASDAQ STOCKHOLM AB - APA SERVICE"]
["NASD","NSDQ DARK"]
["NASX","NASD OTC MARKET"]
["NATX","NATIXIS - SYSTEMATIC INTERNALISER"]
["NBLX","NOBLE EXCHANGE"]
["NBOT","NATIONAL BOARD OF TRADE LIMITED"]
["NCEL","PAKISTAN MERCANTILE EXCHANGE"]
["NCME","SMBC NIKKO CAPITAL MARKETS EUROPE GMBH"]
["NCML","SMBC NIKKO CAPITAL MARKETS LIMITED - SYSTEMATIC INTERNALISER"]
["NDCM","ICE ENDEX UK OCM GAS SPOT"]
["NDEX","ICE ENDEX FUTURES"]
["NDXS","ICE ENDEX EUROPEAN GAS SPOT"]
["NEOC","AEQUITAS NEO EXCHANGE - CONNECT MARKET"]
["NEOD","AEQUITAS NEO EXCHANGE - DARK MARKET"]
["NEOE","AEQUITAS NEO EXCHANGE"]
["NEON","AEQUITAS NEO EXCHANGE - NEO LIT MARKET BY PRICE"]
["NESI","NOMURA EUROPE - SYSTEMATIC INTERNALISER"]
["NEXD","NEX EXCHANGE MAIN BOARD (NON-EQUITY)"]
["NEXF","NEX EXCHANGE GROWTH (NON-EQUITY)"]
["NEXG","NEX EXCHANGE GROWTH (EQUITY)"]
["NEXL","NEX EXCHANGE MAIN BOARD (EQUITY)"]
["NEXN","NEX EXCHANGE TRADING (NON-EQUITY)"]
["NEXO","NOREXECO ASA"]
["NEXS","NEX SEF"]
["NEXT","NEX EXCHANGE TRADING (EQUITY)"]
["NEXX","NEX EXCHANGE"]
["NEXY","EBS MTF - RFQ - FOR CORPORATES TRADING FX PRODUCTS"]
["NFSA","FIDELITY CROSSSTREAM"]
["NFSC","NATIONAL FINANCIAL SERVICES, LLC"]
["NFSD","FIDELITY DARK"]
["NGXC","NATURAL GAS EXCHANGE"]
["NIBC","NIBC - SYSTEMIC INTERNALISER"]
["NIBR","NORWEGIAN INTER BANK OFFERED RATE"]
["NILX","NILE STOCK EXCHANGE"]
["NLBX","NORDDEUTSCHE LANDESBANK - GIROZENTRALE - SYSTEMATIC INTERNALISER"]
["NLPX","APX POWER NL"]
["NMCE","NATIONAL MULTI-COMMODITY EXCHANGE OF INDIA"]
["NMRA","NOMURA SECURITIES INTERNATIONAL"]
["NMRJ","NOMURA SECURITIES CO LTD"]
["NMTF","NORDIC MTF"]
["NOCO","NASDAQ STOCKHOLM AB - COMMODITIES"]
["NODX","NODAL EXCHANGE"]
["NOED","NASDAQ STOCKHOLM AB - NORWEGIAN EQ DERIVATIVES"]
["NOFF","NOMURA OTC TRADES"]
["NOFI","NASDAQ STOCKHOLM AB - NORWEGIAN FI DERIVATIVES"]
["NOPS","NORD POOL SPOT AS"]
["NORD","HSH NORDBANK - SYSTEMATIC INTERNALISER"]
["NORX","NASDAQ OMX COMMODITIES"]
["NOSC","NOS CLEARING ASA"]
["NOSI","NOMURA - SYSTEMATIC INTERNALISER"]
["NOTC","NORWEGIAN OVER THE COUNTER MARKET"]
["NOWX","NOW CP - NEU CP"]
["NPEX","NPEX"]
["NPGA","GASPOINT NORDIC A/S"]
["NSXB","BENDIGO STOCK EXCHANGE LIMITED"]
["NWMS","ROYAL BANK OF SCOTLAND - SYSTEMATIC INTERNALISER"]
["NWNV","NATWEST MARKETS NV"]
["NXEU","NX"]
["NXJP","NX JAPAN"]
["NXSE","NX SELECT JAPAN"]
["NXUS","NX ATS - CROSSING PLATFORM"]
["NXVW","NX VWAP"]
["NYFX","MILLENNIUM"]
["NYMS","CME SWAPS MARKETS (NYMEX)"]
["NYPC","NEW YORK PORTFOLIO CLEARING"]
["NYSD","NYSE DARK"]
["NYSI","NYKREDIT BANK - SYSTEMATIC INTERNALISER"]
["NZFX","NEW ZEALAND FUTURES & OPTIONS"]
["OAPA","OSLO BORS - APA"]
["OBKL","OBERBANK AG - SYSTEMATIC INTERNALISER"]
["OCSI","SOVA CAPITAL - SYSTEMATIC INTERNALISER"]
["ODDO","ODDO BHF"]
["ODOC","ODDO CONTREPARTIE"]
["OHVO","OHV OTF"]
["OLLC","OTCEX LLC"]
["OMEL","OMI POLO ESPANOL S.A. (OMIE)"]
["OMGA","OMEGA ATS"]
["OMIC","THE IBERIAN ENERGY CLEARING HOUSE"]
["OMIP","OPERADOR DE MERCADO IBERICO DE ENERGIA - PORTUGAL"]
["ONSE","FIRST NORTH SWEDEN - NORWAY"]
["OOTC","OTHER OTC"]
["OPCO","OP CORPORATE BANK PLC - SYSTEMATIC INTERNALISER"]
["OPEX","PEX-PRIVATE EXCHANGE"]
["OPRA","OPTIONS PRICE REPORTING AUTHORITY"]
["OSLC","SIX X-CLEAR AG"]
["OTCB","OTCQB MARKETPLACE"]
["OTCE","OTCEX"]
["OTCM","OTC MARKETS"]
["OTCQ","OTCQX MARKETPLACE"]
["OTCX","OTC EXCHANGE OF INDIA"]
["OTPB","OTP BANK NYRT - SYSTEMATIC INTERNALISER"]
["OTXB","BERNER KANTONALBANK OTC-X"]
["PARX","PARFX"]
["PAVE","ALTERNATIVE PLATFORM FOR SPANISH SECURITIES"]
["PBUL","BULGARIAN STOCK EXCHANGE - APA"]
["PDEX","PHILIPPINE DEALING AND EXCHANGE CORP"]
["PDQX","CODA MARKETS"]
["PEEL","PEEL HUNT LLP UK"]
["PFTQ","PFTS QUOTE DRIVEN"]
["PFTS","PFTS STOCK EXCHANGE"]
["PFXD","PARFX DERIVATIVES"]
["PIEU","ARITAS FINANCIAL LTD"]
["PINC","OTC PINK CURRENT"]
["PINI","OTC PINK NO INFORMATION"]
["PINL","OTC PINK LIMITED"]
["PINX","OTC PINK MARKETPLACE"]
["PIPE","ARITAS SECURITIES LLC"]
["PIRM","PIRUM"]
["PKOP","BANK POLSKA KASA OPIEKI S.A. - SYSTEMATIC INTERNALISER"]
["PLDX","PLUS DERIVATIVES EXCHANGE"]
["PLPD","WARSAW STOCK EXCHANGE/COMMODITIES/POLISH POWER EXCHANGE/COMMODITY DERIVATIVES"]
["PLPX","WARSAW STOCK EXCHANGE/COMMODITIES/POLISH POWER EXCHANGE/ENERGY MARKET"]
["PNED","NASDAQ STOCKHOLM AB - PAN-NORDIC EQ DERIVATIVES"]
["PORT","MTS PORTUGAL"]
["POTC","PACIFIC OTC"]
["PPEX","PROPERTY PARTNER EXCHANGE"]
["PROS","PROSPECTS"]
["PRSE","PRAGMA ATS"]
["PSGM","OTC GREY MARKET"]
["PTPG","POLISH TRADING POINT"]
["PURE","PURE TRADING"]
["PVMF","PVM OTF"]
["PXIL","POWER EXCHANGE INDIA LTD."]
["QWIX","Q-WIXX PLATFORM"]
["R5FX","R5FX LIMITED"]
["RABO","RABOBANK - SYSTEMATIC INTERNALISER"]
["RBCB","RBC INVESTOR SERVICES BANK S.A."]
["RBCC","RBC - LONDON BRANCH"]
["RBCE","RBC EUROPE LIMITED"]
["RBCG","RBC CAPITAL MARKETS (EUROPE) GMBH"]
["RBCM","RBC - ROYAL BANK OF CANADA"]
["RBCT","RBC INVESTOR SERVICES TRUST"]
["RBHU","RAIFFEISEN BANK (HUNGARY) - SYSTEMATIC INTERNALISER"]
["RBIV","RAIFFEISEN BANK INTERNATIONAL AG - SYSTEMATIC INTERNALISER"]
["RBSI","RBC INVESTOR SERVICES BANK S.A. - SYSTEMATIC INTERNALISER"]
["RBSX","RBS CROSS"]
["RENC","RENAISSANCE SECURITIES (CYPRUS) LIMITED"]
["RESE","EBS MTF - RESET"]
["REST","NEX SEF MTF - RESET - RISK MITIGATION SERVICES"]
["RFBK","RAIFFEISENBANK, AS.  - SYSTEMATIC INTERNALISER"]
["RICD","RIVERCROSS DARK"]
["RICX","RIVERCROSS"]
["RLBO","RAIFFEISENLANDESBANK OBERÖSTERREICH - SYSTEMATIC INTERNALISER"]
["RMTF","REFINITIV MTF"]
["RMTS","MTS ISRAEL"]
["ROCO","TAIPEI EXCHANGE"]
["ROFX","ROSARIO FUTURE EXCHANGE"]
["ROSR","SIX REPO AG"]
["ROTC","RWANDA OTC MARKET"]
["RPDX","MOSCOW ENERGY EXCHANGE"]
["RPWC","WARSAW STOCK EXCHANGE/BONDS/CATALYST/BONDSPOT/REGULATED MARKET"]
["RSEX","RWANDA STOCK EXCHANGE"]
["RTSI","RBC INVESTOR SERVICES TRUST - SYSTEMATIC INTERNALISER"]
["RTSL","REUTERS TRANSACTION SERVICES LIMITED"]
["RTSX","MOSCOW EXCHANGE - DERIVATIVES MARKET"]
["RUSX","NON-PROFIT PARTNERSHIP FOR THE DEVELOPMENT OF FINANCIAL MARKET RTS"]
["S3FM","SOCIETY3 FUNDERSMART"]
["SANT","BANCO SANTANDER S.A. - SYSTEMATIC INTERNALISER"]
["SB1M","SPAREBANK 1 MARKETS - SYSTEMATIC INTERNALISER"]
["SBAR","BOLSA DE BARCELONA RENTA FIJA"]
["SBEX","SCOTIABANK - SYSTEMATIC INTERNALISER"]
["SBIJ","SBI JAPANNEXT-J-MARKET"]
["SBIL","BOLSA DE BILBAO RENTA FIJA"]
["SBIU","SBI JAPANNEXT - U - MARKET"]
["SBIV","SBI JAPANNEXT - VWAP CROSSING"]
["SBSI","SYDBANK A/S"]
["SCAG","STANDARD CHARTERED BANK AG - SYSTEMATIC INTERNALISER"]
["SCXA","SEED DIGITAL SECURITIES MARKET"]
["SCXF","SEED FUTURES"]
["SCXM","SEED DIGITAL COMMODITIES MARKET"]
["SCXO","SEED CX"]
["SCXS","SEED SEF"]
["SEBS","SEB - SYSTEMATIC INTERNALISER"]
["SECF","SECFINEX"]
["SEDX","SECURITISED DERIVATIVES MARKET"]
["SEED","NASDAQ STOCKHOLM AB - SWEDISH EQ DERIVATIVES"]
["SELC","SISTEMA ESPECIAL DE LIQUIDACAO E CUSTODIA DE TITULOS PUBLICOS"]
["SEMX","SEMOPX"]
["SEND","SEND - SISTEMA ELECTRONICO DE NEGOCIACION DE DEUDA"]
["SEPE","STOCK EXCHANGE PERSPECTIVA"]
["SFCL","SWISSCANTO FUNDS CENTRE LIMITED"]
["SGAS","SG AMERICAS SECURITIES, LLC"]
["SGEX","SHANGHAI GOLD EXCHANGE"]
["SGMA","GOLDMAN SACH MTF"]
["SGMT","SIGMA X2"]
["SGMX","SIGMA X MTF"]
["SGMY","SIGMA X MTF - AUCTION BOOK"]
["SGOE","SG OPTION EUROPE - SYSTEMATIC INTERNALISER"]
["SHAD","D.E. SHAW DARK"]
["SHAR","ASSET MATCH"]
["SHAW","D.E. SHAW"]
["SHSC","STOCK EXCHANGE OF HONG KONG LIMITED - SHANGHAI - HONG KONG STOCK CONNECT"]
["SIAB","ALIOR BANK - SYSTEMATIC INTERNALISER"]
["SIBC","SIB CYPRUS LTD - SYSTEMATIC INTERNALISER"]
["SICS","CREDIT SUISSE SECURITIES (EUROPE) LIMITED - SYSTEMATIC INTERNALISER"]
["SIGA","SIGMA X AUSTRALIA"]
["SIGH","SIGMA X HONG KONG"]
["SIGJ","SIGMA X JAPAN"]
["SIMD","CREDIT SUISSE EU - SYSTEMATIC INTERNALISER"]
["SIMV","SIM VENTURE SECURITIES EXCHANGE"]
["SISI","SUSQUEHANNA INTERNATIONAL SECURITIES LIMITED - SYSTEMATIC INTERNALISER"]
["SKSI","SPAREKASSEN KRONJYLLAND - SYSTEMATIC INTERNALISER"]
["SLHB","SALZBURGER LANDES-HYPOTHEKENBANK"]
["SLKK","MTS SLOVAKIA"]
["SMBB","SUMITOMO MITSUI BANKING CORPORATION - BRUSSELS BRANCH - SYSTEMATIC INTERNALISER"]
["SMBD","SUMITOMO MITSUI BANKING CORPORATION -  DUESSELDORF BRANCH - SYSTEMATIC INTERNALISER"]
["SMBE","SUMITOMO MITSUI BANKING CORPORATION EUROPE LIMITED"]
["SMBG","SUMITOMO MITSUI BANKING CORPORATION - LONDON BRANCH - SYSTEMATIC INTERNALISER"]
["SMBP","SUMITOMO MITSUI BANKING CORPORATION EUROPE LIMITED - PARIS BRANCH"]
["SMEX","SINGAPORE MERCANTILE EXCHANGE PTE LTD"]
["SMFE","SMALL EXCHANGE, INC - DESIGNATED CONTRACT MARKET"]
["SMFF","SMBC BANK EU AG - SYSTEMATIC INTERNALISER"]
["SMTS","MTS SPAIN"]
["SNSI","SPAR NORD BANK - SYSTEMATIC INTERNALISER"]
["SOHO","TWO SIGMA SECURITIES, LLC"]
["SPDX","SPREADEX"]
["SPEC","MAREX SPECTRON INTERNATIONAL LIMITED OTF"]
["SPIM","ST. PETERSBURG INTERNATIONAL MERCANTILE EXCHANGE"]
["SPRZ","SPREADZERO"]
["SPTR","SPAREBANK 1 SMN - SYSTEMATIC INTERNALISER"]
["SPXE","SPX"]
["SQUA","SQUARE GLOBAL - OTF"]
["SSBI","STATE STREET BANK INTERNATIONAL GMBH"]
["SSBM","STATE STREET BANK INTERNATIONAL FX - SYSTEMATIC INTERNALISER"]
["SSBT","STATE STREET BANK AND TRUST COMPANY"]
["SSEX","SOCIAL STOCK EXCHANGE"]
["SSFX","STATE STREET BANK AND TRUST FX - SYSTEMATIC INTERNALISER"]
["SSME","FIRST NORTH SWEDEN - SME GROWTH MARKET"]
["SSOB","BONDVISION EUROPE MTF"]
["SSTX","E-EXCHANGE"]
["SSWM","SSW MARKET MAKING - SYSTEMATIC INTERNALISER"]
["STAN","STANDARD CHARTERED - SYSTEMATIC INTERNALISER"]
["STEE","NASDAQ COMMODITIES - STEEL COMMODITY"]
["STFL","STIFEL NICOLAUS EUROPE LIMITED -SYSTEMATIC INTERNALISER"]
["STOX","STOXX LIMITED"]
["STUA","BOERSE STUTTGART - REGULIERTER MARKT"]
["STUB","BOERSE STUTTGART - FREIVERKEHR"]
["STUC","BOERSE STUTTGART - REGULIERTER MARKT - TECHNICAL PLATFORM 2"]
["STUD","BOERSE STUTTGART - FREIVERKEHR - TECHNICAL PLATFORM 2"]
["SUNB","SUNRISE BROKERS"]
["SUNO","SUNRISE - OTF"]
["SUNT","SUN TRADING LLC"]
["SVES","SVENSKA HANDELSBANKEN AB - SYSTEMATIC INTERNALISER"]
["SVEX","SVENSKA HANDELSBANKEN AB - SVEX"]
["SWAP","SWAPSTREAM"]
["SWBI","SWEDBANK - SYSTEMATIC INTERNALISER"]
["SWEE","SWEDBANK ESTONIA - SYSTEMATIC INTERNALISER"]
["SWLT","SWEDBANK LITHUANIA - SYSTEMATIC INTERNALISER"]
["SWLV","SWEDBANK LATVIA - SYSTEMATIC INTERNALISER"]
["SZSC","STOCK EXCHANGE OF HONG KONG LIMITED - SHENZHEN - HONG KONG STOCK CONNECT"]
["TBSP","WARSAW STOCK EXCHANGE/BONDS/BONDSPOT/TREASURY BOND MARKET"]
["TCDS","TRADITION OTF"]
["TCML","TIDE CM"]
["TDBL","TORONTO DOMINION BANK - LONDON BRANCH"]
["TDON","TRADITION PARIS - TSAF"]
["TECO","TULLETT PREBON EUROPE - OTF - COMMODITY AND ENERGY DERIVATIVES"]
["TEEG","TULLETT PREBON SECURITIES - OTF - EUROPEAN GOVERNMENT BONDS"]
["TEFD","TULLETT PREBON EUROPE -  MTF - FX DERIVATIVES"]
["TEFX","TULLETT PREBON EUROPE - OTF - FX DERIVATIVES"]
["TEGB","TULLETT PREBON EUROPE - OTF - GOVERNMENT BONDS EXCLUDING UK GILTS"]
["TEGI","TULLETT PREBON EUROPE - OTF - GOVERNMENT BONDS - UK GILTS"]
["TEIR","TULLETT PREBON EUROPE - OTF - INTEREST RATE DERIVATIVES"]
["TEMB","TULLETT PREBON EUROPE -  MTF - GOVERNMENT BONDS EXCLUDING UK GILTS"]
["TEMF","TULLETT PREBON EUROPE -  MTF - CORPORATE BONDS AND SECURITISED DEBT"]
["TEMI","TULLETT PREBON EUROPE -  MTF - MONEY MARKETS"]
["TEMM","TULLETT PREBON EUROPE - OTF - MONEY MARKET INSTRUMENTS"]
["TEMR","TULLETT PREBON EUROPE -  MTF - REPOS"]
["TERA","TERAEXCHANGE"]
["TERE","TULLETT PREBON EUROPE - OTF - REPOS"]
["TFEX","THAILAND FUTURES EXCHANGE"]
["TFSA","TFS GREEN AUSTRALIAN GREEN MARKETS"]
["TFSD","T.F.S. DERIVATIVES HK LIMITED"]
["TFSU","TFS GREEN UNITED STATES GREEN MARKETS"]
["TGAT","TRADEGATE EXCHANGE"]
["TGSI","TRADEGATE EXCHANGE - SYSTEMATIC INTERNALISER"]
["THEM","THEMIS TRADING LLC"]
["THRE","THOMSON REUTERS (SEF) LLC"]
["TIRD","TULLETT PREBON EUROPE - MTF - INTEREST RATE DERIVATIVES"]
["TMID","TRUMID ATS"]
["TNLA","EURONEXT - TRADED BUT NOT LISTED AMSTERDAM"]
["TNLB","EURONEXT - TRADING FACILITY BRUSSELS"]
["TNLL","EURONEXT - TRADING FACILITY LONDON"]
["TOCP","TORA CROSSPOINT"]
["TOMG","TULLETT PREBON EUROPE - OTF - MADRID - GOVERNMENT BONDS - EXCLUDING GILTS"]
["TOWR","TOWER RESEARCH CAPITAL EUROPE - SYSTEMATIC INTERNALISER"]
["TPEL","TULLETT PREBON (EUROPE) LIMITED"]
["TPEO","TULLETT PREBON EUROPE - OTF"]
["TPES","TULLETT PREBON EUROPE - OTF - MADRID"]
["TPEU","TULLETT PREBON EU OTF"]
["TPIC","TP ICAP EU - MTF"]
["TPIE","THE PROPERTY INVESTMENT EXCHANGE"]
["TPIO","TP ICAP EU - MTF - ORDERBOOK"]
["TPIR","TP ICAP EU - MTF - REGISTRATION"]
["TPSE","TP SEF, INC."]
["TPSL","TULLETT PREBON SECURITIES - MTF"]
["TPSO","TULLETT PREBON SECURITIES - OTF"]
["TQEA","TURQUOISE EUROPE - LIT AUCTIONS"]
["TQEB","TURQUOISE EUROPE - NYLON CASH ORDER BOOK"]
["TQEM","TURQUOISE EUROPE - DARK"]
["TQEX","TURQUOISE EUROPE"]
["TRAL","REUTERS TRANSACTION SERVICES LIMITED - FXALL RFQ"]
["TRAS","TRADITION ASIA LIMITED"]
["TRAX","TRAX APA"]
["TRCK","TRACK ECN"]
["TRDE","TRADITION"]
["TRDX","TRAD-X"]
["TREA","TRADEWEB EUROPE LIMITED - APA"]
["TREO","TRADEWEB EUROPE LIMITED - OTF"]
["TREU","TRADEWEB EUROPE LIMITED"]
["TRFW","REUTERS TRANSACTION SERVICES LIMITED - FORWARDS MATCHING"]
["TRNL","TRAX NL APA"]
["TRPX","TROP-X"]
["TRQA","TURQUOISE LIT AUCTIONS"]
["TRQB","TURQUOISE NYLON CASH ORDER BOOK"]
["TRQC","TURQUOISE CFD"]
["TRQM","TURQUOISE PLATO"]
["TRQS","TURQUOISE SWAPMATCH"]
["TRQX","TURQUOISE"]
["TRSI","TOWER RESEARCH CAPITAL EUROPE LTD"]
["TRU1","TRUEEX LLC - DESIGNATED CONTRACT MARKET (DMC)"]
["TRU2","TRUEEX LLC - SEF (SWAP EXECUTION FACILITY)"]
["TRUX","TRUEEX LLC"]
["TRWB","TRADEWEB LLC"]
["TRXE","TRAD-X EUROPE"]
["TSAD","TRADITION SECURITIES AND DERIVATIVES INC."]
["TSAF","TSAF OTC - OTF"]
["TSBX","DBOT ATS, LLC"]
["TSCB","TULLETT PREBON SECURITIES - OTF - CORPORATE BONDS"]
["TSCD","TULLETT PREBON SECURITIES - OTF - CREDIT DERIVATIVES"]
["TSED","TULLETT PREBON SECURITIES - OTF - EQUITY DERIVATIVES"]
["TSEF","TRADITION SEF"]
["TSFI","TULLETT PREBON SECURITIES - OTF - CORPORATE BONDS AND SECURITISED DEBT"]
["TSGB","TULLETT PREBON SECURITIES - OTF - GOVERNMENT BONDS EXCLUDING UK GILTS"]
["TSGI","TULLETT PREBON SECURITIES - OTF - GOVERNMENT BONDS - UK GILTS"]
["TSIG","TRADITION SINGAPORE PTE. LTD."]
["TSMM","TULLETT PREBON SECURITIES - OTF - MONEY MARKET INSTRUMENTS"]
["TSMR","TULLETT PREBON SECURITIES - MTF - REPOS"]
["TSRE","TULLETT PREBON SECURITIES - OTF - REPOS"]
["TWEA","TRADEWEB EU BV - APA"]
["TWEM","TRADEWEB EU BV - MTF"]
["TWEO","TRADEWEB EU BV - OTF"]
["TWEU","TRADEWEB EU BV"]
["TWGP","TRADEWEB EUROPE LIMITED - GLOBAL TRADING PLATFORM"]
["TWHK","TRADEWEB EUROPE LIMITED - HONG KONG"]
["TWJP","TRADEWEB JAPAN KK - PTS"]
["TWJT","TRADEWEB JAPAN KK - ETP"]
["TWSF","TW SEF LLC"]
["TWSG","TRADEWEB EUROPE LIMITED - SINGAPORE"]
["UBCZ","UNICREDIT BANK CZECH REPUBLIC AND SLOVAKIA, A.S."]
["UBIM","UBI BANCA - SYSTEMATIC INTERNALISER"]
["UBIN","UNION BANK OF INDIA UK LTD"]
["UBIS","UNIPOL BANCA S.P.A."]
["UBSA","UBS ATS"]
["UBSB","UBS AG LONDON BRANCH EMEA TRADING"]
["UBSC","UBS PIN-FX"]
["UBSD","UBS EUROPE SE"]
["UBSE","UBS PIN (EMEA)"]
["UBSF","UBS FX"]
["UBSG","UBS TRADING"]
["UBSI","UBS LIMITED EMEA TRADING - SYSTEMATIC INTERNALISER"]
["UBSL","UBS LIMITED EMEA TRADING"]
["UBSP","UBS PIN (UBS PRICE IMPROVEMENT NETWORK)"]
["UBSS","UBS SECURITIES LLC"]
["UBSX","UBS CROSS"]
["UBSY","UBS AG LONDON BRANCH - SYSTEMATIC INTERNALISER"]
["UCBA","UNICREDIT BANK AUSTRIA AG"]
["UCDE","UNICREDIT BANK AG - SYSTEMATIC INTERNALISER"]
["UCIT","UNICREDIT SPA - SYSTEMATIC INTERNALISER"]
["UFEX","UFEX"]
["UICE","UKRAINIAN INTERBANK CURRENCY EXCHANGE"]
["UKEX","UKRAINIAN EXCHANGE"]
["UKGD","MTS UK"]
["UKPX","APX POWER UK"]
["ULTX","ALT XCHANGE (U)"]
["USWB","NASDAQ STOCKHOLM AB - USD WB EQ DERIVATIVES"]
["UTSL","UEDA TRADITION SECURITIES LTD."]
["VABD","BONDPOINT"]
["VAGL","VIRTUAL AUCTION GLOBAL LIMITED"]
["VALX","VIRTU CLIENT MARKET MAKING"]
["VCMO","VANTAGE CAPITAL MARKETS LLP - OTF"]
["VCRS","VIRTU MATCHIT - CONDITIONAL ROOM"]
["VEGA","VEGA-CHI"]
["VERT","VERTICAL"]
["VFCM","VIRTU FINANCIAL CAPITAL MARKETS LLC"]
["VFIL","VIRTU FINANCIAL IRELAND LIMITED"]
["VFMI","VIRTU MATCHIT - MAIN CROSSING SESSION"]
["VFSI","VIRTU FINANCIAL IRELAND LIMITED - SYSTEMATIC INTERNALISER"]
["VFXO","VIRTU FINANCIAL IRELAND LIMITED - OTC"]
["VIRT","VIRTU FINANCIAL BD"]
["VLEX","VONTOBEL LIQUIDITY EXTENDER"]
["VMFX","THE FAROESE SECURITIES MARKET"]
["VMTS","MTS SLOVENIA"]
["VONT","BANK VONTOBEL EUROPE AG - SYSTEMATIC INTERNALISER"]
["VPXB","EURONEXT - VENTES PUBLIQUES BRUSSELS"]
["VTBC","VTB CAPITAL PLC - SYSTEMATIC INTERNALISER"]
["VTEX","VORTEX"]
["VTLS","TRADELINK"]
["VTPS","TRADEPLUS"]
["VUSA","VIRTU AMERICAS LLC"]
["VWDX","VWD TRANSACTIONSOLUTIONS AG"]
["WBAH","WIENER BOERSE AG AMTLICHER HANDEL (OFFICIAL MARKET)"]
["WBCL","WARSAW STOCK EXCHANGE/BONDS/CATALYST/LISTING"]
["WBDM","WIENER BOERSE AG DRITTER MARKT (THIRD MARKET)"]
["WBGF","WIENER BOERSE AG GEREGELTER FREIVERKEHR (SECOND REGULATED MARKET)"]
["WBKP","BANK ZACHODNI WBK S.A. - SYSTEMATIC INTERNALISER"]
["WBON","WARSAW STOCK EXCHANGE/ BONDS/CATALYST/MAIN MARKET"]
["WDER","WARSAW STOCK EXCHANGE/FINANCIAL DERIVATIVES"]
["WEED","WEEDEN AND CO MARKETS"]
["WELN","WEL - SYSTEMATIC INTERNALISER"]
["WELS","WELLS FARGO SECURITIES, LLC - CASH EQUITIES"]
["WETP","WARSAW STOCK EXCHANGE/ ETPS"]
["WGAS","WARSAW STOCK EXCHANGE/COMMODITIES/POLISH POWER EXCHANGE/GAS"]
["WIND","WARSAW STOCK EXCHANGE/INDICES"]
["WINS","WINTERFLOOD SECURITIES LIMITED - ELECTRONIC PLATFORM"]
["WINX","WINTERFLOOD SECURITIES LIMITED - MANUAL TRADING"]
["WIPO","WARSAW STOCK EXCHANGE - IPO BOOK BUILDING"]
["WMTF","WARSAW STOCK EXCHANGE/BONDS/CATALYST/MTF"]
["WOOD","WOOD & COMPANY FINANCIAL SERVICES, A.S. - SYSTEMATIC INTERNALISER"]
["WOPO","WARSAW STOCK EXCHANGE - SPO BOOK BUILDING"]
["WQXL","EURONEXT - MARKET WITHOUT QUOTATIONS LISBON"]
["WSAG","WALL STREET ACCESS"]
["WSIL","WELLS FARGO SECURITIES INTERNATIONAL"]
["WSIN","WESTPAC BANKING CORPORATION - SYSTEMATIC INTERNALISER"]
["XABC","ABG SUNDAL COLLIER AB - SYSTEMATIC INTERNALISER"]
["XABG","ABG SUNDAL COLLIER ASA - SYSTEMATIC INTERNALISER"]
["XADE","ATHENS EXCHANGE S.A. DERIVATIVES MARKET"]
["XADF","FINRA ALTERNATIVE DISPLAY FACILITY (ADF)"]
["XADS","ABU DHABI SECURITIES EXCHANGE"]
["XAFR","ALTERNATIVA FRANCE"]
["XAFX","AFRICAN STOCK EXCHANGE"]
["XAIM","AIM ITALIA - MERCATO ALTERNATIVO DEL CAPITALE"]
["XALG","ALGIERS STOCK EXCHANGE"]
["XALT","ALTEX-ATS"]
["XAMM","AMMAN STOCK EXCHANGE"]
["XAMS","EURONEXT - EURONEXT AMSTERDAM"]
["XAPA","EURONEXT - APA"]
["XAQS","AUTOMATED EQUITY FINANCE MARKETS"]
["XARM","NASDAQ OMX ARMENIA"]
["XASE","NYSE MKT LLC"]
["XASX","ASX - ALL MARKETS"]
["XATH","ATHENS EXCHANGE S.A. CASH MARKET"]
["XATL","ATLANTIC SECURITIES MARKET"]
["XATS","ALPHA EXCHANGE"]
["XBAA","BAHAMAS INTERNATIONAL SECURITIES EXCHANGE"]
["XBAB","BARBADOS STOCK EXCHANGE"]
["XBAH","BAHRAIN BOURSE"]
["XBAN","BANGALORE STOCK EXCHANGE LTD"]
["XBAR","BOLSA DE BARCELONA"]
["XBBJ","JAKARTA FUTURES EXCHANGE (BURSA BERJANGKA JAKARTA)"]
["XBBK","PERIMETER FINANCIAL CORP. - BLOCKBOOK ATS"]
["XBCC","BOLSA DE COMERCIO DE CORDOBA"]
["XBCL","LA BOLSA ELECTRONICA DE CHILE"]
["XBCM","BOLSA DE COMERCIO DE MENDOZA S.A."]
["XBCV","BOLSA CENTROAMERICANA DE VALORES S.A."]
["XBCX","MERCADO DE VALORES DE MENDOZA S.A."]
["XBDA","BERMUDA STOCK EXCHANGE LTD"]
["XBDV","BOLSA DE DIVIDA E VALORES DE ANGOLA (BODIVA) - ANGOLA SECURITIES EXCHANGE"]
["XBEL","BELGRADE STOCK EXCHANGE"]
["XBER","BOERSE BERLIN"]
["XBES","JSE CASH BOND MARKET"]
["XBEY","BOURSE DE BEYROUTH - BEIRUT STOCK EXCHANGE"]
["XBIL","BOLSA DE VALORES DE BILBAO"]
["XBKF","STOCK EXCHANGE OF THAILAND - FOREIGN BOARD"]
["XBKK","STOCK EXCHANGE OF THAILAND"]
["XBLB","BANJA LUKA STOCK EXCHANGE"]
["XBLK","EURONEXT BLOCK 2"]
["XBLN","BLUENEXT"]
["XBNV","BOLSA NACIONAL DE VALORES, S.A."]
["XBOG","BOLSA DE VALORES DE COLOMBIA"]
["XBOL","BOLSA BOLIVIANA DE VALORES S.A."]
["XBOM","BSE LTD"]
["XBOS","NASDAQ OMX BX"]
["XBOT","BOTSWANA STOCK EXCHANGE"]
["XBOX","BOX OPTIONS EXCHANGE"]
["XBRA","BRATISLAVA STOCK EXCHANGE"]
["XBRD","EURONEXT - EURONEXT BRUSSELS - DERIVATIVES"]
["XBRM","ROMANIAN  COMMODITIES EXCHANGE"]
["XBRN","BX SWISS AG"]
["XBRT","BRUT ECN"]
["XBRU","EURONEXT - EURONEXT BRUSSELS"]
["XBRV","BOURSE REGIONALE DES VALEURS MOBILIERES"]
["XBSD","DERIVATIVES REGULATED MARKET - BVB"]
["XBSE","SPOT REGULATED MARKET - BVB"]
["XBTR","SIX SWISS BILATERAL TRADING PLATFORM FOR STRUCTURED OTC PRODUCTS"]
["XBUD","BUDAPEST STOCK EXCHANGE"]
["XBUE","BOLSA DE COMERCIO DE BUENOS AIRES"]
["XBUL","BULGARIAN STOCK EXCHANGE"]
["XBVC","CAPE VERDE STOCK EXCHANGE"]
["XBVM","MOZAMBIQUE STOCK  EXCHANGE"]
["XBVR","BOLSA DE VALORES DE LA REPUBLICA DOMINICANA SA."]
["XBXO","NASDAQ OMX BX OPTIONS"]
["XCAI","EGYPTIAN EXCHANGE"]
["XCAL","CALCUTTA STOCK EXCHANGE"]
["XCAN","CAN-ATS"]
["XCAS","CASABLANCA STOCK EXCHANGE"]
["XCAY","CAYMAN ISLANDS STOCK EXCHANGE"]
["XCBF","CBOE FUTURES EXCHANGE"]
["XCBO","CBOE GLOBAL MARKETS INC."]
["XCBT","CHICAGO BOARD OF TRADE"]
["XCDE","BAXTER FINANCIAL SERVICES"]
["XCEC","COMMODITIES EXCHANGE CENTER"]
["XCET","UZBEK COMMODITY EXCHANGE"]
["XCFE","CHINA FOREIGN EXCHANGE TRADE SYSTEM"]
["XCFF","CANTOR FINANCIAL FUTURES EXCHANGE"]
["XCGS","CHINESE GOLD & SILVER EXCHANGE SOCIETY"]
["XCHG","CHITTAGONG STOCK EXCHANGE LTD."]
["XCHI","NYSE CHICAGO, INC."]
["XCIE","THE INTERNATIONAL STOCK EXCHANGE"]
["XCIS","NYSE NATIONAL, INC."]
["XCME","CHICAGO MERCANTILE EXCHANGE"]
["XCNF","BOLSA DE COMERCIO CONFEDERADA S.A."]
["XCNQ","CANADIAN NATIONAL STOCK EXCHANGE"]
["XCOL","COLOMBO STOCK EXCHANGE"]
["XCOR","ICMA"]
["XCRO","CROATIAN POWER EXCHANGE"]
["XCSE","NASDAQ COPENHAGEN A/S"]
["XCSX","CAMBODIA SECURITIES EXCHANGE"]
["XCUE","UZBEKISTAN REPUBLICAN CURRENCY EXCHANGE"]
["XCUR","CURRENEX"]
["XCX2","CX2"]
["XCXD","NASDAQ CXD"]
["XCYO","CYPRUS STOCK EXCHANGE - OTC"]
["XCYS","CYPRUS STOCK EXCHANGE"]
["XDAR","DAR ES  SALAAM STOCK EXCHANGE"]
["XDBC","DEUTSCHE BOERSE AG - CUSTOMIZED INDICES"]
["XDBV","DEUTSCHE BOERSE AG - VOLATILITY INDICES"]
["XDBX","DEUTSCHE BOERSE AG - INDICES"]
["XDCE","DALIAN COMMODITY EXCHANGE"]
["XDES","DELHI STOCK EXCHANGE"]
["XDFB","JOINT-STOCK COMPANY “STOCK EXCHANGE INNEX”"]
["XDFM","DUBAI FINANCIAL MARKET"]
["XDHA","DHAKA STOCK EXCHANGE LTD"]
["XDMI","ITALIAN DERIVATIVES MARKET"]
["XDNB","DNB BANK ASA - SYSTEMATIC INTERNALISER"]
["XDPA","CADE - MERCADO DE DEUDA PUBLICA ANOTADA"]
["XDRF","AIAF - MERCADO DE RENTA FIJA"]
["XDSE","DAMASCUS SECURITIES EXCHANGE"]
["XDSM","BORSA ISTANBUL - DEBT SECURITIES MARKET"]
["XDSX","DOUALA STOCK EXCHANGE"]
["XDUB","IRISH STOCK EXCHANGE - ALL MARKET"]
["XDUS","BOERSE DUESSELDORF"]
["XEBI","ENERGY BROKING IRELAND GAS TRADING PLATFORM"]
["XECB","ECB EXCHANGE RATES"]
["XECC","EUROPEAN COMMODITY CLEARING AG"]
["XECM","MTF - CYPRUS EXCHANGE"]
["XECS","EASTERN CARIBBEAN SECURITIES EXCHANGE"]
["XEDA","ELECTRICITY DAY-AHEAD MARKET"]
["XEEE","EUROPEAN ENERGY EXCHANGE"]
["XEEO","EUROPEAN ENERGY EXCHANGE - NON-MTF MARKET"]
["XEER","EUROPEAN ENERGY EXCHANGE - REGULATED MARKET"]
["XEHQ","EUREX REPO - HQLA MARKET"]
["XEID","ELECTRICITY INTRA-DAY MARKET"]
["XELX","ELX"]
["XEMD","MERCADO MEXICANO DE DERIVADOS"]
["XEMS","EMS EXCHANGE"]
["XEQT","BOERSE BERLIN EQUIDUCT TRADING"]
["XEQY","BORSA ISTANBUL - EQUITY MARKET"]
["XERE","EUREX REPO - FUNDING AND FINANCING PRODUCTS"]
["XERT","EUREX REPO - TRIPARTY"]
["XESM","EURONEXT GROWTH DUBLIN"]
["XETA","XETRA - REGULIERTER MARKT"]
["XETB","XETRA - FREIVERKEHR"]
["XETF","EURONEXT ETF ACCESS"]
["XETR","XETRA"]
["XETS","XETRA - SCALE"]
["XEUB","EUREX BONDS"]
["XEUC","EURONEXT COM, COMMODITIES FUTURES AND OPTIONS"]
["XEUE","EURONEXT EQF, EQUITIES AND INDICES DERIVATIVES"]
["XEUI","EURONEXT IRF, INTEREST RATE FUTURE AND OPTIONS"]
["XEUM","EUREX REPO SECLEND MARKET"]
["XEUP","EUREX REPO GMBH"]
["XEUR","EUREX DEUTSCHLAND"]
["XEYE","IRISH STOCK EXCHANGE  - GLOBAL EXCHANGE MARKET"]
["XFCI","FINANCIALCONTENT - INDEXES"]
["XFDA","FINANCIALCONTENT - DIGITAL ASSET TRADE REPORTING FACILITY"]
["XFEX","FINANCIAL AND ENERGY EXCHANGE GROUP"]
["XFKA","FUKUOKA STOCK EXCHANGE"]
["XFNO","BORSA ISTANBUL - FUTURES AND OPTIONS MARKET"]
["XFRA","DEUTSCHE BOERSE AG"]
["XGAS","CENTRAL EASTERN EUROPEAN GAS EXCHANGE LTD"]
["XGAT","TRADEGATE EXCHANGE - FREIVERKEHR"]
["XGCL","GLOBAL COAL LIMITED"]
["XGCX","GLOBAL COMMODITIES EXCHANGE"]
["XGDX","GLOBAL DERIVATIVES EXCHANGE"]
["XGEM","HONG KONG GROWTH ENTERPRISES MARKET"]
["XGHA","GHANA STOCK EXCHANGE"]
["XGME","GESTORE MERCATO ELETTRICO - ITALIAN POWER EXCHANGE"]
["XGMX","GLOBALCLEAR MERCANTILE EXCHANGE"]
["XGRM","TRADEGATE EXCHANGE - REGULIERTER MARKT"]
["XGSE","GEORGIA STOCK EXCHANGE"]
["XGSX","GLOBAL SECURITIES EXCHANGE"]
["XGTG","BOLSA DE VALORES NACIONAL SA"]
["XGUA","BOLSA DE VALORES DE GUAYAQUIL"]
["XHAM","HANSEATISCHE WERTPAPIERBOERSE HAMBURG"]
["XHAN","NIEDERSAECHSISCHE BOERSE ZU HANNOVER"]
["XHEL","NASDAQ HELSINKI LTD"]
["XHKF","HONG KONG FUTURES EXCHANGE LTD."]
["XHKG","HONG KONG EXCHANGES AND CLEARING LTD"]
["XHNF","HANOI STOCK EXCHANGE - DERIVATIVES"]
["XHNX","HANOI STOCK EXCHANGE (UNLISTED PUBLIC COMPANY TRADING PLATFORM)"]
["XIBE","BAKU INTERBANK CURRENCY EXCHANGE"]
["XICB","SIX CORPORATE BONDS AG"]
["XICE","NASDAQ ICELAND HF."]
["XICX","INSTINET CANADA CROSS"]
["XIDX","INDONESIA STOCK EXCHANGE"]
["XIEL","INSTINET EUROPE LIMITED"]
["XIHK","INSTINET PACIFIC LTD"]
["XIMA","INTERNATIONAL MARTIME EXCHANGE"]
["XIMC","MULTI COMMODITY EXCHANGE OF INDIA LTD."]
["XIMM","INTERNATIONAL MONETARY MARKET"]
["XINE","SHANGHAI INTERNATIONAL ENERGY EXCHANGE"]
["XINS","INSTINET"]
["XINV","INVESTRO"]
["XIOM","INDEX AND OPTIONS MARKET"]
["XIPO","HELEX ELECTRONIC BOOK BUILDING"]
["XIQS","IRAQ STOCK EXCHANGE"]
["XISA","INTERNATIONAL SECURITIES EXCHANGE, LLC -  ALTERNATIVE MARKETS"]
["XISE","INTERNATIONAL SECURITIES EXCHANGE, LLC - EQUITIES"]
["XIST","BORSA ISTANBUL"]
["XISX","INTERNATIONAL SECURITIES EXCHANGE, LLC"]
["XJAM","JAMAICA STOCK EXCHANGE"]
["XJAS","TOKYO STOCK EXCHANGE JASDAQ"]
["XJNB","JAKARTA NEGOTIATED BOARD"]
["XJPX","JAPAN EXCHANGE GROUP"]
["XJSE","JOHANNESBURG STOCK EXCHANGE"]
["XKAC","OSAKA DOJIMA COMMODITY EXCHANGE"]
["XKAR","THE PAKISTAN STOCK EXCHANGE LIMITED"]
["XKAZ","KAZAKHSTAN STOCK EXCHANGE"]
["XKBT","KANSAS CITY BOARD OF TRADE"]
["XKCE","KHOREZM INTERREGION COMMODITY EXCHANGE"]
["XKCM","KOREA EXCHANGE COMMODITY MARKET"]
["XKEM","KOREA EXCHANGE EMISSIONS MARKET"]
["XKFB","KOREA FREEBOARD MARKET"]
["XKFE","KOREA EXCHANGE (FUTURES MARKET)"]
["XKHA","KHARTOUM STOCK EXCHANGE"]
["XKHR","KHARKOV COMMODITY EXCHANGE"]
["XKIE","KIEV UNIVERSAL EXCHANGE"]
["XKIS","KIEV INTERNATIONAL STOCK EXCHANGE"]
["XKLS","BURSA MALAYSIA"]
["XKON","KOREA NEW EXCHANGE"]
["XKOS","KOREA EXCHANGE (KOSDAQ)"]
["XKRX","KOREA EXCHANGE (STOCK MARKET)"]
["XKSE","KYRGYZ STOCK EXCHANGE"]
["XKUW","KUWAIT STOCK EXCHANGE"]
["XLAO","LAO SECURITIES EXCHANGE"]
["XLAT","LATIBEX"]
["XLBM","LONDON BULLION MARKET"]
["XLCH","LCH.CLEARNET LTD"]
["XLDN","EURONEXT - EURONEXT LONDON"]
["XLDX","LONDON DERIVATIVES EXCHANGE"]
["XLFX","LABUAN INTERNATIONAL FINANCIAL EXCHANGE"]
["XLGT","LGT BANK AG - SYSTEMATIC INTERNALISER"]
["XLIM","BOLSA DE VALORES DE LIMA"]
["XLIS","EURONEXT - EURONEXT LISBON"]
["XLIT","AB NASDAQ VILNIUS"]
["XLJM","SI ENTER"]
["XLJU","LJUBLJANA STOCK EXCHANGE (OFFICIAL MARKET)"]
["XLLB","LIECHTENSTEINISCHE LANDESBANK AG - SYSTEMATIC INTERNALISER"]
["XLME","LONDON METAL EXCHANGE"]
["XLOD","LONDON STOCK EXCHANGE - DERIVATIVES MARKET"]
["XLOM","LONDON STOCK EXCHANGE - MTF"]
["XLON","LONDON STOCK EXCHANGE"]
["XLSM","LIBYAN STOCK MARKET"]
["XLUS","LUSAKA STOCK EXCHANGE"]
["XLUX","LUXEMBOURG STOCK EXCHANGE"]
["XMAB","MERCADO ABIERTO ELECTRONICO S.A."]
["XMAD","BOLSA DE MADRID"]
["XMAE","MACEDONIAN STOCK EXCHANGE"]
["XMAI","MARKET FOR ALTERNATIVE INVESTMENT"]
["XMAL","MALTA STOCK EXCHANGE"]
["XMAN","BOLSA DE VALORES DE NICARAGUA"]
["XMAT","EURONEXT PARIS MATIF"]
["XMAU","STOCK EXCHANGE OF MAURITIUS LTD"]
["XMDG","MARCHE INTERBANCAIRE DES DEVISES M.I.D."]
["XMDS","MADRAS STOCK EXCHANGE"]
["XMER","MERCHANTS' EXCHANGE"]
["XMEV","MERCADO DE VALORES DE BUENOS AIRES S.A."]
["XMEX","BOLSA MEXICANA DE VALORES (MEXICAN STOCK EXCHANGE)"]
["XMGE","MINNEAPOLIS GRAIN EXCHANGE"]
["XMIL","BORSA ITALIANA S.P.A."]
["XMIO","MIAMI INTERNATIONAL SECURITIES EXCHANGE"]
["XMLI","EURONEXT ACCESS PARIS"]
["XMNT","BOLSA DE VALORES DE MONTEVIDEO"]
["XMNX","MONTENEGRO STOCK EXCHANGE"]
["XMOC","MONTREAL CLIMATE EXCHANGE"]
["XMOD","THE MONTREAL EXCHANGE / BOURSE DE MONTREAL"]
["XMOL","MOLDOVA STOCK EXCHANGE"]
["XMON","EURONEXT PARIS MONEP"]
["XMOS","MOSCOW STOCK EXCHANGE"]
["XMOT","EXTRAMOT"]
["XMPW","MEFF POWER DERIVATIVES"]
["XMRV","MEFF FINANCIAL DERIVATIVES"]
["XMSM","EURONEXT DUBLIN"]
["XMSW","MALAWI STOCK EXCHANGE"]
["XMTB","MERCADO A TERMINO DE BUENOS AIRES S.A."]
["XMTS","EUROMTS LTD"]
["XMUN","BOERSE MUENCHEN"]
["XMUS","MUSCAT SECURITIES MARKET"]
["XMVL","MERCADO DE VALORES DEL LITORAL S.A."]
["XNAF","SISTEMA ESPANOL DE NEGOCIACION DE ACTIVOS FINANCIEROS"]
["XNAI","NAIROBI STOCK EXCHANGE"]
["XNAM","NAMIBIAN STOCK EXCHANGE"]
["XNAS","NASDAQ - ALL MARKETS"]
["XNCD","NATIONAL COMMODITY & DERIVATIVES EXCHANGE LTD"]
["XNCM","NASDAQ CAPITAL MARKET"]
["XNCO","WARSAW STOCK EXCHANGE/ EQUITIES/NEW CONNECT-MTF"]
["XNDQ","NASDAQ OPTIONS MARKET"]
["XNDU","PJSC NATIONAL DEPOSITORY OF UKRAINE"]
["XNDX","NORDIC DERIVATIVES EXCHANGE"]
["XNEC","NATIONAL STOCK EXCHANGE OF AUSTRALIA LIMITED"]
["XNEP","NEPAL STOCK EXCHANGE"]
["XNFI","NASDAQ FIXED INCOME TRADING"]
["XNGM","NORDIC GROWTH MARKET"]
["XNGO","NAGOYA STOCK EXCHANGE"]
["XNGS","NASDAQ/NGS (GLOBAL SELECT MARKET)"]
["XNIM","NASDAQ INTERMARKET"]
["XNKS","CENTRAL JAPAN COMMODITIES EXCHANGE"]
["XNLI","NYSE LIFFE"]
["XNMR","NORDIC MTF REPORTING"]
["XNMS","NASDAQ/NMS (GLOBAL MARKET)"]
["XNOR","NORDEA - SYSTEMATIC INTERNALISER"]
["XNSA","THE NIGERIAN STOCK EXCHANGE"]
["XNSE","NATIONAL STOCK EXCHANGE OF INDIA"]
["XNXC","NXCHANGE"]
["XNXD","NXCHANGE B.V. MTF"]
["XNYE","NEW YORK MERCANTILE EXCHANGE - OTC MARKETS"]
["XNYL","NEW YORK MERCANTILE EXCHANGE - ENERGY MARKETS"]
["XNYM","NEW YORK MERCANTILE EXCHANGE"]
["XNYS","NEW YORK STOCK EXCHANGE, INC."]
["XNZE","NEW ZEALAND EXCHANGE LTD"]
["XOAA","OSLO BORS ASA - OSLO AXESS LIT X AUCTIONS"]
["XOAD","OSLO AXESS NORTH SEA - DARK POOL"]
["XOAM","NORDIC ALTERNATIVE BOND MARKET"]
["XOAS","OSLO AXESS"]
["XOCH","ONECHICAGO, LLC"]
["XODE","ODESSA COMMODITY EXCHANGE"]
["XOFF","OFF-EXCHANGE TRANSACTIONS - LISTED INSTRUMENTS"]
["XOPV","OTC PUBLICATION VENUE"]
["XOSA","OSLO BORS - LIT X AUCTIONS"]
["XOSC","OSLO CONNECT"]
["XOSD","OSLO BORS NORTH SEA - DARK POOL"]
["XOSE","OSAKA EXCHANGE"]
["XOSJ","OSAKA EXCHANGE J-NET"]
["XOSL","OSLO BORS ASA"]
["XOTC","OTCBB"]
["XPAC","POSIT AUCTION"]
["XPAE","PALESTINE SECURITIES EXCHANGE"]
["XPAR","EURONEXT - EURONEXT PARIS"]
["XPBT","NASDAQ OMX FUTURES EXCHANGE"]
["XPET","SAINT PETERSBURG EXCHANGE"]
["XPHL","NASDAQ OMX PHLX"]
["XPHO","PHILADELPHIA OPTIONS EXCHANGE"]
["XPHS","PHILIPPINE STOCK EXCHANGE, INC."]
["XPHX","PEEL HUNT CROSSING"]
["XPIC","SAINT-PETERSBURG CURRENCY EXCHANGE"]
["XPMS","BORSA ISTANBUL - PRECIOUS METALS AND DIAMONDS MARKETS"]
["XPOM","PORT MORESBY STOCK EXCHANGE"]
["XPOR","PORTAL"]
["XPOS","POSIT DARK"]
["XPOT","POWERNEXT - OTF"]
["XPOW","POWERNEXT"]
["XPRA","PRAGUE STOCK EXCHANGE"]
["XPRI","PRIDNEPROVSK COMMODITY EXCHANGE"]
["XPRM","PRAGUE STOCK EXCHANGE - MTF"]
["XPSF","POWERNEXT - GAS SPOT AND FUTURES"]
["XPST","POSIT - ASIA PACIFIC"]
["XPSX","NASDAQ OMX PSX"]
["XPTY","BOLSA DE VALORES DE PANAMA, S.A."]
["XPUK","XP INVESTMENTS UK LLP"]
["XPXE","POWER EXCHANGE CENTRAL EUROPE"]
["XQMH","SIX SWISS EXCHANGE – STRUCTURED PRODUCTS"]
["XQTX","BOERSE DUESSELDORF - QUOTRIX"]
["XQUI","BOLSA DE VALORES DE QUITO"]
["XRAS","RASDAQ"]
["XRBM","RINGGIT BOND MARKET"]
["XRCB","RAIFFEISEN CENTROBANK AG - SYSTEMATIC INTERNALISER"]
["XREP","SIX REPO AG - CH REPO MARKET"]
["XRFQ","POSIT RFQ"]
["XRIS","NASDAQ RIGA AS"]
["XRMO","RM-SYSTEM CZECH STOCK EXCHANGE (MTF)"]
["XRMZ","RM-SYSTEM CZECH STOCK EXCHANGE"]
["XROS","BOLSA DE COMERCIO ROSARIO"]
["XROT","SIX REPO AG - OTC SPOT MARKET"]
["XROX","MERCADO DE VALORES DE ROSARIO S.A."]
["XRPM","ROMANIAN POWER MARKET"]
["XRSP","PEEL HUNT RETAIL"]
["XRUS","INTERNET DIRECT-ACCESS EXCHANGE"]
["XSAF","JSE EQUITY DERIVATIVES MARKET"]
["XSAM","SAMARA CURRENCY INTERBANK EXCHANGE"]
["XSAP","SAPPORO SECURITIES EXCHANGE"]
["XSAT","SPOTLIGHT STOCK MARKET"]
["XSAU","SAUDI STOCK EXCHANGE"]
["XSBI","SBI JAPANNEXT - X - MARKET"]
["XSBT","SINGAPORE EXCHANGE BOND TRADING PTE. LTD"]
["XSC1","BOERSE FRANKFURT WARRANTS TECHNICAL 1"]
["XSC2","BOERSE FRANKFURT WARRANTS TECHNICAL 2"]
["XSC3","BOERSE FRANKFURT WARRANTS TECHNICAL 3"]
["XSCA","SINGAPORE CATALIST MARKET"]
["XSCE","SINGAPORE COMMODITY EXCHANGE"]
["XSCO","BOERSE FRANKFURT WARRANTS TECHNICAL"]
["XSCU","STOXX LIMITED - CUSTOMIZED INDICES"]
["XSEB","SIX SWISS EXCHANGE - EBBO BOOK"]
["XSEC","SHENZHEN STOCK EXCHANGE - SHENZHEN - HONG KONG STOCK CONNECT"]
["XSEF","SWAPEX, LLC"]
["XSES","SINGAPORE EXCHANGE"]
["XSFA","JSE COMMODITY DERIVATIVES MARKET"]
["XSFE","ASX - TRADE24"]
["XSGA","SOCIETE GENERALE - SYSTEMATIC INTERNALISER"]
["XSGE","SHANGHAI FUTURES EXCHANGE"]
["XSGO","SANTIAGO STOCK EXCHANGE"]
["XSHE","SHENZHEN STOCK EXCHANGE"]
["XSHG","SHANGHAI STOCK EXCHANGE"]
["XSIB","SIBERIAN EXCHANGE"]
["XSIM","SINGAPORE EXCHANGE DERIVATIVES CLEARING LIMITED"]
["XSLS","SIX SWISS EXCHANGE - SLS"]
["XSMP","EURONEXT BLOCK"]
["XSOP","BSP REGIONAL ENERGY EXCHANGE - SOUTH POOL"]
["XSPM","EURONEXT STRUCTURED PRODUCTS MTF"]
["XSPS","SOUTH PACIFIC STOCK EXCHANGE"]
["XSSC","SHANGHAI STOCK EXCHANGE - SHANGHAI - HONG KONG STOCK CONNECT"]
["XSSE","SARAJEVO STOCK EXCHANGE"]
["XSTC","HOCHIMINH STOCK EXCHANGE"]
["XSTE","REPUBLICAN STOCK EXCHANGE"]
["XSTF","BOERSE STUTTGART - TECHNICAL PLATFORM 2"]
["XSTM","FIDELITY CROSSSTREAM ATS"]
["XSTO","NASDAQ STOCKHOLM AB"]
["XSTU","BOERSE STUTTGART"]
["XSTV","STOXX LIMITED - VOLATILITY INDICES"]
["XSTX","STOXX LIMITED - INDICES"]
["XSVA","EL SALVADOR STOCK EXCHANGE"]
["XSWA","SWAZILAND STOCK EXCHANGE"]
["XSWB","SWX SWISS BLOCK"]
["XSWM","SIX SWISS EXCHANGE - SIX SWISS EXCHANGE AT MIDPOINT"]
["XSWX","SIX SWISS EXCHANGE"]
["XTAE","TEL AVIV STOCK EXCHANGE"]
["XTAF","TAIWAN FUTURES EXCHANGE"]
["XTAI","TAIWAN STOCK EXCHANGE"]
["XTAL","NASDAQ TALLINN AS"]
["XTAM","TOKYO STOCK EXCHANGE-TOKYO PRO MARKET"]
["XTEH","TEHRAN STOCK EXCHANGE"]
["XTFF","TOKYO FINANCIAL  EXCHANGE"]
["XTIR","TIRANA STOCK EXCHANGE"]
["XTK1","TOKYO STOCK EXCHANGE - TOSTNET-1"]
["XTK2","TOKYO STOCK EXCHANGE - TOSTNET-2"]
["XTK3","TOKYO STOCK EXCHANGE - TOSTNET-3"]
["XTKS","TOKYO STOCK EXCHANGE"]
["XTKT","TOKYO COMMODITY EXCHANGE"]
["XTND","XTEND"]
["XTNX","TSX VENTURE EXCHANGE - NEX"]
["XTRD","XTRD"]
["XTRN","TRINIDAD AND TOBAGO STOCK EXCHANGE"]
["XTRZ","ZAGREB MONEY AND SHORT TERM SECURITIES MARKET INC"]
["XTSE","TORONTO STOCK EXCHANGE"]
["XTSX","TSX VENTURE EXCHANGE"]
["XTUC","NUEVA BOLSA DE COMERCIO DE TUCUMAN S.A."]
["XTUN","BOURSE DE TUNIS"]
["XTXE","XTX MARKETS SAS"]
["XTXM","XTX MARKETS"]
["XUAX","UKRAINIAN STOCK EXCHANGE"]
["XUBS","UBS MTF"]
["XUGA","UGANDA SECURITIES EXCHANGE"]
["XUKR","UKRAINIAN UNIVERSAL COMMODITY EXCHANGE"]
["XULA","MONGOLIAN STOCK EXCHANGE"]
["XUMP","UBS MTF - PERIODIC AUCTION"]
["XUNI","UNIVERSAL BROKER'S EXCHANGE 'TASHKENT'"]
["XUSE","UNITED STOCK EXCHANGE"]
["XVAL","BOLSA DE VALENCIA"]
["XVES","VESTIMA"]
["XVIE","WIENER BOERSE AG, WERTPAPIERBOERSE (SECURITIES EXCHANGE)"]
["XVPA","BOLSA DE VALORES Y PRODUCTOS DE ASUNCION SA"]
["XVPB","VP BANK AG - SYSTEMATIC INTERNALISER"]
["XVTX","SIX SWISS EXCHANGE - BLUE CHIPS SEGMENT"]
["XWAR","WARSAW STOCK EXCHANGE/EQUITIES/MAIN MARKET"]
["XWBO","WIENER BOERSE AG"]
["XWEE","WEEDEN ATS"]
["XXSC","FRANKFURT CEF SC"]
["XXXX","NO MARKET (E.G. UNLISTED)"]
["XYIE","YIELDBROKER PTY LTD"]
["XZAG","ZAGREB STOCK EXCHANGE"]
["XZAM","THE ZAGREB STOCK EXCHANGE MTF"]
["XZAP","PROGRESS MARKET"]
["XZCE","ZHENGZHOU COMMODITY EXCHANGE"]
["XZIM","ZIMBABWE STOCK EXCHANGE"]
["YLDX","JSE INTEREST RATE DERIVATIVES MARKET"]
["ZAPA","ZAGREB STOCK EXCHANGE - APA"]
["ZARX","ZAR X"]
["ZBUL","BULGARIAN STOCK EXCHANGE - MAIN MARKET"]
["ZFXM","JSE CURRENCY DERIVATIVES MARKET"]
["ZKBX","ZURCHER KANTONALBANK SECURITIES EXCHANGE"]
["ZOBX","ZOBEX"]

{"sheet":"Config","index":23,"n_rows":165,"n_cols":96,"rows_kept":165,"cut":false,"hidden":true,"merged":[]}
[null,null,null,"Number of Capacity selection",2,null,null,"Margin ShortFall",2,"Bank Code","Bank Name",164,"Securities Code","Securities Type",27,null,null,"Currency Code","Currency ",27,"Type of Return",2,"Analysis of Sharholders Fund",2,"Credit Facilities Group",50,"Qualifying criteria",7,null,"Total No. of Array Field:",116,null,null,null,"Credit Type","Nature",20,null,null,null,null,null,"Month",12,"Year",20,"Group Number",10,null,"Geographical location",2,null,"Affiliate of the licensed corporation",2,null,"Nature of the product",4,null,"Relationship with the licensed corporation",5,null,"Description of the general nature of the balance",3,null,"Nature of security",4,null,"Type of the underlying securities",5,null,"Type of the securities borrowed",4,null,"Type of the securities lent",4,null,"Purpose for Note 2",3,null,"Purpose for Note 3",3,null,"Geographical location of counterparty/ custodian",8,null,"Geographical location of the approved bank",8,null,"Geographical location ",8,null,"Type of counterparty",4,null,"Geographical location of associated entities / other licensed providers",9]
[null,"Protect? (\"Y\" or blank)","y","Declaration Capacity",null,null,null,null,null,1,"ABN AMRO BANK N.V.",null,"1a","Unsecured (i.e. clean facility)",null,null,null,"ARS","Argentine Peso",null,null,null,null,null,null,null,null,null,null,"Array Field Name","No. of Row","Key Column","Form No.",null,"1a","Overdraft available to the licensed corporation only"]
[null,"Password",null,"Responsible officer","A",null,null,"Trade date basis","A",2,"AGRICULTURAL BANK OF CHINA LIMITED",null,"2a","Letter of comfort",null,null,null,"AUD","Australian Dollar",null,"MONTHLY","A","Final","A",1,null,"Authorized financial institution","a",null,"LCC0086A",5,"LCC0086A",1,null,"1b","Overdraft shared with other entity(ies)",null,null,null,null,null,null,"01",null,2021,null,1,null,null,"Hong Kong","A",null,"Yes","A",null,"Listed shares (including ETFs and listed REITs but excluding debt securities)","A",null,"Parent company","A",null,"Loans","A",null,"Securities","A",null,"HK listed stocks","A",null,"Shares listed on a specified exchange","A",null,"Shares listed on a specified exchange","A",null,"Safe custody","A",null,"Safe custody","A",null,"United States of America","A",null,"United States of America","A",null,"United States of America","A",null,"Clearing House","A",null,"Hong Kong","A"]
[null,"Form Name","FRR","Officer approved by the Commission under section 58(5)(e) of the Securities and Futures (Financial Resources) Rules","B",null,null,"Settlement date basis","B",3,"AIRSTAR BANK LIMITED",null,"3a","Guarantee provided by shareholder/director",null,null,null,"BRL","Brazil Real",null,"SEMI-ANNUAL RETURN","B","Interim","B",2,null,"Licensed corporation licensed for leveraged foreign exchange trading","b",null,"LCC0086B",5,"LCC0086A",1,null,"2a","Term loan / revolving loan available to the licensed corporation only",null,null,null,null,null,null,"02",null,2022,null,2,null,null,"Outside Hong Kong","B",null,"No","B",null,"Debt securities","B",null,"Subsidiary","B",null,"Management fee","B",null,"Land and properties","B",null,"Overseas listed stocks","B",null,"Qualifying debt securities","B",null,"Qualifying debt securities","B",null,"Pledged as collateral","B",null,"Pledged as collateral","B",null,"United Kingdom","B",null,"United Kingdom","B",null,"United Kingdom","B",null,"Broker","B",null,"United States of America","B"]
[null,"Form Version","11",null,null,null,null,null,null,4,"ANT BANK (HONG KONG) LIMITED",null,"3b","Guarantee provided by group company",null,null,null,"GBP","British Pound",null,null,null,null,null,3,null,"Corporation licensed for dealing in futures contracts ","c",null,"LCC0086C",5,"LCC0086A",1,null,"2b","Term loan / revolving loan shared with other entity(ies)",null,null,null,null,null,null,"03",null,2023,null,3,null,null,null,null,null,null,null,null,"Investment funds (excluding ETFs and listed REITs)","C",null,"Group company","C",null,"Others","C",null,"Others","C",null,"Bonds","C",null,"Special debt securities","C",null,"Special debt securities","C",null,"Others","C",null,"Others","C",null,"Japan","C",null,"Japan","C",null,"Japan","C",null,"Custodian","C",null,"United Kingdom","C"]
[null,"Delimiter","$$$",null,null,null,null,null,null,5,"AUSTRALIA AND NEW ZEALAND BANKING GROUP LIMITED",null,"3c","Guarantee provided by other party",null,null,null,"CAD","Canadian Dollar",null,null,null,null,null,4,null,"Equivalent corporation deals in currency futures contracts","d",null,"LCC0086",5,"LCC0086A",1,null,"3a","Drawing against uncleared effects / intra-day credit facility available to the licensed corporation only",null,null,null,null,null,null,"04",null,2024,null,4,null,null,null,null,null,null,null,null,"Others","D",null,"Director of the licensed corporation","D",null,null,null,null,"N/A","D",null,"Investment funds","D",null,"Other securities","D",null,"Other securities","D",null,null,null,null,null,null,null,"Mainland China","D",null,"Mainland China","D",null,"Mainland China","D",null,"Others","D",null,"Japan","D"]
[null,"Checksum",null,null,null,null,null,null,null,6,"BANCO BILBAO VIZCAYA ARGENTARIA S.A.",null,"4a","Letter of indemnity provided by shareholder/director",null,null,null,"CNY","China Renminbi",null,null,null,null,null,5,null,"Bank incorporated in a specified jurisdiction and regulated by a specified bank regulator","e",null,"LCC0099A",50,"LCC0099A",1,null,"3b","Drawing against uncleared effects / intra-day credit facility shared with other entity(ies)",null,null,null,null,null,null,"05",null,2025,null,5,null,null,null,null,null,null,null,null,null,null,null,"Others","E",null,null,null,null,null,null,null,"Others","E",null,null,null,null,null,null,null,null,null,null,null,null,null,"Singapore","E",null,"Singapore","E",null,"Singapore","E",null,null,null,null,"Mainland China","E"]
[null,"Sub Version","3",null,null,null,null,null,null,7,"BANCO SANTANDER, S.A.",null,"4b","Letter of indemnity provided by group company",null,null,null,"DKK","Danish Krone",null,null,null,null,null,6,null,"Corporation that has issued debt instruments which continue to attract a qualifying credit rating","f",null,"LCC0099B",50,"LCC0099A",1,null,"4a","Letter of credit available to the licensed corporation only",null,null,null,null,null,null,"06",null,2026,null,6,null,null,null,null,null,null,null,null,null,null,null,null,null,null,null,null,null,null,null,null,null,null,null,null,null,null,null,null,null,null,null,null,null,null,null,"Korea","F",null,"Korea","F",null,"Korea","F",null,null,null,null,"Singapore","F"]
[null,"No. of Forms",24,null,null,null,null,null,null,8,"BANGKOK BANK PUBLIC COMPANY LIMITED",null,"4c","Letter of indemnity provided by other party",null,null,null,"EUR","Euro",null,null,null,null,null,7,null,"Institution which the Commission is satisfied its recognitions as counterparty","g",null,"LCC0099C",50,"LCC0099A",1,null,"4b","Letter of credit shared with other entity(ies)",null,null,null,null,null,null,"07",null,2027,null,7,null,null,null,null,null,null,null,null,null,null,null,null,null,null,null,null,null,null,null,null,null,null,null,null,null,null,null,null,null,null,null,null,null,null,null,"Taiwan","G",null,"Taiwan","G",null,"Taiwan","G",null,null,null,null,"Korea","G"]
[null,"Form","Form Code","Sub Form Code","Sheet No.",null,null,null,null,9,"BANK J. SAFRA SARASIN AG",null,"5a","Letter of credit",null,null,null,"HKD","Hong Kong Dollar",null,null,null,null,null,8,null,null,null,null,"LCC0099",50,"LCC0099A",1,null,"5a","IPO financing facility available to the licensed corporation only",null,null,null,null,null,null,"08",null,2028,null,8,null,null,null,null,null,null,null,null,null,null,null,null,null,null,null,null,null,null,null,null,null,null,null,null,null,null,null,null,null,null,null,null,null,null,null,"Others","H",null,"Others","H",null,"Others","H",null,null,null,null,"Taiwan","H"]
[null,"Form 1 - Liquid Capital Computation","LCC","LCC",1,null,null,null,null,10,"BANK JULIUS BAER & CO. LTD.",null,"6a","Deposit provided by the licensed corporation",null,null,null,"INR","Indian Rupee",null,null,null,null,null,9,null,null,null,null,"LCC0102A",3,"LCC0102A",1,null,"5b","IPO financing facility shared with other entity(ies)",null,null,null,null,null,null,"09",null,2029,null,9,null,null,null,null,null,null,null,null,null,null,null,null,null,null,null,null,null,null,null,null,null,null,null,null,null,null,null,null,null,null,null,null,null,null,null,null,null,null,null,null,null,null,null,null,null,null,null,"Others","I"]
[null,"Form 1 - Assets","LCC","LCC",2,null,null,null,null,11,"BANK OF AMERICA, NATIONAL ASSOCIATION",null,"6b","Deposit provided by shareholder/director",null,null,null,"IDR","Indonesian Rupiah",null,null,null,null,null,10,null,null,null,null,"LCC0102B",3,"LCC0102A",1,null,6,"Subordinated loan other than approved subordinated loan",null,null,null,null,null,null,"10",null,2030,null,10]
[null,"Form 1 - Liabilities","LCC","LCC",3,null,null,null,null,12,"BANK OF BARODA",null,"6c","Deposit provided by group company",null,null,null,"JPY","Japanese Yen",null,null,null,null,null,11,null,null,null,null,"LCC0102",3,"LCC0102A",1,null,"7a","Instalment / Mortgage loan facility available to the licensed corporation only",null,null,null,null,null,null,"11",null,2031]
[null,"Form 1 - Declaration","LCC","LCC",4,null,null,null,null,13,"BANK OF CHINA (HONG KONG) LIMITED",null,"6d","Deposit provided by other party",null,null,null,"MYR","Malaysian Ringgit",null,null,null,null,null,12,null,null,null,null,"LCC0103",3,"LCC0103",1,null,"7b","Instalment / Mortgage loan facility shared with other entity(ies)",null,null,null,null,null,null,"12",null,2032]
[null,"Form 2","RLC","RLC",5,null,null,null,null,14,"BANK OF CHINA LIMITED",null,"7a","Land and building provided by the licensed corporation",null,null,null,"NZD","New Zealand Dollar",null,null,null,null,null,13,null,null,null,null,"LCC0104",3,"LCC0103",1,null,8,"Bank guarantee",null,null,null,null,null,null,null,null,2033]
[null,"Form 3","CFS","CFS",6,null,null,null,null,15,"BANK OF COMMUNICATIONS (HONG KONG) LIMITED",null,"7b","Land and building provided by shareholder/director",null,null,null,"NOK","Norwegian Krone",null,null,null,null,null,14,null,null,null,null,"LCC0105",3,"LCC0103",1,null,"9a","Foreign exchange contract facility available to the licensed corporation only",null,null,null,null,null,null,null,null,2034]
[null,"Form 4 - Table 1","MCA","ULB",7,null,null,null,null,16,"BANK OF COMMUNICATIONS CO., LTD.",null,"7c","Land and building provided by group company",null,null,null,"PHP","Philippines Peso",null,null,null,null,null,15,null,null,null,null,"LCC0106",3,"LCC0103",1,null,"9b","Foreign exchange contract facility shared with other entity(ies)",null,null,null,null,null,null,null,null,2035]
[null,"Form 4 - Table 2","MCA","AJB",8,null,null,null,null,17,"BANK OF EAST ASIA, LIMITED (THE)",null,"7d","Land and building provided by other party",null,null,null,"RUB","Russian Ruble",null,null,null,null,null,16,null,null,null,null,"LCC0106A",3,"LCC0103",1,null,10,"Corporate credit card facility",null,null,null,null,null,null,null,null,2036]
[null,"Form 5","ASC","ASC",9,null,null,null,null,18,"BANK OF INDIA",null,"8a","Marketable securities provided by margin clients",null,null,null,"SGD","Singapore Dollar",null,null,null,null,null,17,null,null,null,null,"LCC0106B",3,"LCC0103",1,null,11,"Uncommitted credit facility",null,null,null,null,null,null,null,null,2037]
[null,"Form 6","RBC","RBC",10,null,null,null,null,19,"BANK OF MONTREAL",null,"8b","Marketable securities provided by the licensed corporation",null,null,null,"ZAR","South African Rand",null,null,null,null,null,18,null,null,null,null,"LCC0109",3,"LCC0109",1,null,"99a","Other facility available to the licensed corporation only",null,null,null,null,null,null,null,null,2038]
[null,"Form 7","PLA","PLA",11,null,null,null,null,20,"BANK OF NEW YORK MELLON (THE)",null,"8c","Marketable securities provided by shareholder/director",null,null,null,"KRW","South Korean Won",null,null,null,null,null,19,null,null,null,null,"LCC0110",3,"LCC0109",1,null,"99b","Other facility shared with other entity(ies)",null,null,null,null,null,null,null,null,2039]
[null,"Form 8 - Table 1","ACA","CS",12,null,null,null,null,21,"BANK OF NOVA SCOTIA (THE)",null,"8d","Marketable securities provided by group company",null,null,null,"SEK","Swedish Krona",null,null,null,null,null,20,null,null,null,null,"LCC0111",3,"LCC0109",1,null,null,null,null,null,null,null,null,null,null,null,2040]
[null,"Form 8 - Table 2","ACA","CSF",13,null,null,null,null,22,"BANK OF SINGAPORE LIMITED",null,"8e","Marketable securities by other party",null,null,null,"CHF","Swiss Franc",null,null,null,null,null,21,null,null,null,null,"LCC0112",3,"LCC0109",1]
[null,"Form 9","FCP","FCP",14,null,null,null,null,23,"BANK OF TAIWAN",null,"9a","Unquoted shares provided by the licensed corporation",null,null,null,"TWD","Taiwan Dollar",null,null,null,null,null,22,null,null,null,null,"LCC0113",3,"LCC0109",1]
[null,"Form 10 - Table 1","PDP","NAE",15,null,null,null,null,24,"BANK SINOPAC",null,"9b","Unquoted shares provided by shareholder/director",null,null,null,"THB","Thai Baht",null,null,null,null,null,23,null,null,null,null,"LCC0114",3,"LCC0109",1]
[null,"Form 10 - Table 2","PDP","MUV",16,null,null,null,null,25,"BANQUE PICTET & CIE SA",null,"9c","Unquoted shares provided by group company",null,null,null,"USD","US Dollar",null,null,null,null,null,24,null,null,null,null,"LCC0115",3,"LCC0115",1]
[null,"Form 10 - Table 3","PDP","NAT",17,null,null,null,null,26,"BARCLAYS BANK PLC",null,"9d","Unquoted shares provided by other party",null,null,null,"VND","Vietnam Dong",null,null,null,null,null,25,null,null,null,null,"LCC0116",3,"LCC0115",1]
[null,"Form 10 - Table 4","PDP","ICQ",18,null,null,null,null,27,"BDO UNIBANK, INC.",null,99,"Other security",null,null,null,"099","Other",null,null,null,null,null,26,null,null,null,null,"LCC0117",3,"LCC0115",1]
[null,"Form 10 - Table 5","PDP","IPD",19,null,null,null,null,28,"BNP PARIBAS",null,null,null,null,null,null,null,null,null,null,null,null,null,27,null,null,null,null,"LCC0118",3,"LCC0115",1]
[null,"Form 10 - Table 6","PDP","DTR",20,null,null,null,null,29,"BNP PARIBAS SECURITIES SERVICES",null,null,null,null,null,null,null,null,null,null,null,null,null,28,null,null,null,null,"LCC0119",3,"LCC0115",1]
[null,"Form 11","LRC","LRC",21,null,null,null,null,30,"CA INDOSUEZ (SWITZERLAND) SA",null,null,null,null,null,null,null,null,null,null,null,null,null,29,null,null,null,null,"LCC0120",3,"LCC0115",1]
[null,"Form 12","OI","OI",22,null,null,null,null,31,"CANADIAN IMPERIAL BANK OF COMMERCE",null,null,null,null,null,null,null,null,null,null,null,null,null,30,null,null,null,null,"LCC0121A",3,"LCC0121A",1]
[null,null,null,null,23,null,null,null,null,32,"CANARA BANK",null,null,null,null,null,null,null,null,null,null,null,null,null,31,null,null,null,null,"LCC0122A",3,"LCC0121A",1]
[null,null,null,null,24,null,null,null,null,33,"CATHAY BANK",null,null,null,null,null,null,null,null,null,null,null,null,null,32,null,null,null,null,"LCC0123A",3,"LCC0121A",1]
[null,null,null,null,25,null,null,null,null,34,"CATHAY UNITED BANK COMPANY, LIMITED",null,null,null,null,null,null,null,null,null,null,null,null,null,33,null,null,null,null,"LCC0124A",3,"LCC0121A",1]
[null,null,null,null,26,null,null,null,null,35,"CHANG HWA COMMERCIAL BANK, LTD.",null,null,null,null,null,null,null,null,null,null,null,null,null,34,null,null,null,null,"LCC0125A",3,"LCC0121A",1]
[null,null,null,null,27,null,null,null,null,36,"CHIBA BANK, LTD. (THE)",null,null,null,null,null,null,null,null,null,null,null,null,null,35,null,null,null,null,"LCC0126A",3,"LCC0121A",1]
[null,null,null,null,28,null,null,null,null,37,"CHINA BOHAI BANK CO., LTD.",null,null,null,null,null,null,null,null,null,null,null,null,null,36,null,null,null,null,"LCC0195A",3,"LCC0195A",1]
[null,null,null,null,29,null,null,null,null,38,"CHINA CITIC BANK INTERNATIONAL LIMITED",null,null,null,null,null,null,null,null,null,null,null,null,null,37,null,null,null,null,"LCC0196A",3,"LCC0195A",1]
[null,null,null,null,30,null,null,null,null,39,"CHINA CONSTRUCTION BANK (ASIA) CORPORATION LIMITED",null,null,null,null,null,null,null,null,null,null,null,null,null,38,null,null,null,null,"LCC0197A",3,"LCC0195A",1]
[null,null,null,null,31,null,null,null,null,40,"CHINA CONSTRUCTION BANK CORPORATION",null,null,null,null,null,null,null,null,null,null,null,null,null,39,null,null,null,null,"LCC0198A",3,"LCC0195A",1]
[null,null,null,null,32,null,null,null,null,41,"CHINA DEVELOPMENT BANK",null,null,null,null,null,null,null,null,null,null,null,null,null,40,null,null,null,null,"LCC0199A",3,"LCC0195A",1]
[null,null,null,null,33,null,null,null,null,42,"CHINA EVERBRIGHT BANK CO., LTD.",null,null,null,null,null,null,null,null,null,null,null,null,null,41,null,null,null,null,"LCC0200A",3,"LCC0195A",1]
[null,null,null,null,34,null,null,null,null,43,"CHINA GUANGFA BANK CO., LTD.",null,null,null,null,null,null,null,null,null,null,null,null,null,42,null,null,null,null,"LCC0201A",3,"LCC0201A",1]
[null,null,null,null,null,null,null,null,null,44,"CHINA MERCHANTS BANK CO., LTD.",null,null,null,null,null,null,null,null,null,null,null,null,null,43,null,null,null,null,"LCC0202A",3,"LCC0201A",1]
[null,null,null,null,null,null,null,null,null,45,"CHINA MINSHENG BANKING CORP., LTD.",null,null,null,null,null,null,null,null,null,null,null,null,null,44,null,null,null,null,"LCC0203A",3,"LCC0201A",1]
[null,null,null,null,null,null,null,null,null,46,"CHINA ZHESHANG BANK CO., LTD.",null,null,null,null,null,null,null,null,null,null,null,null,null,45,null,null,null,null,"LCC0204A",3,"LCC0201A",1]
[null,null,null,null,null,null,null,null,null,47,"CHIYU BANKING CORPORATION LIMITED",null,null,null,null,null,null,null,null,null,null,null,null,null,46,null,null,null,null,"LCC0205A",3,"LCC0201A",1]
[null,null,null,null,null,null,null,null,null,48,"CHONG HING BANK LIMITED",null,null,null,null,null,null,null,null,null,null,null,null,null,47,null,null,null,null,"LCC0206A",3,"LCC0201A",1]
[null,null,null,null,null,null,null,null,null,49,"CHUGOKU BANK, LTD (THE)",null,null,null,null,null,null,null,null,null,null,null,null,null,48,null,null,null,null,"LCC0207A",3,"LCC0201A",1]
[null,null,null,null,null,null,null,null,null,50,"CIMB BANK BERHAD",null,null,null,null,null,null,null,null,null,null,null,null,null,49,null,null,null,null,"CFS1001",50,"CFS1001",3]
[null,null,null,null,null,null,null,null,null,51,"CITIBANK (HONG KONG) LIMITED",null,null,null,null,null,null,null,null,null,null,null,null,null,50,null,null,null,null,"CFS0001",50,"CFS1001",3]
[null,null,null,null,null,null,null,null,null,52,"CITIBANK, N.A.",null,null,null,null,null,null,null,null,null,null,null,null,null,null,null,null,null,null,"CFS0002",50,"CFS1001",3]
[null,null,null,null,null,null,null,null,null,53,"CMB WING LUNG BANK LIMITED",null,null,null,null,null,null,null,null,null,null,null,null,null,null,null,null,null,null,"CFS1002",50,"CFS1001",3]
[null,null,null,null,null,null,null,null,null,54,"COMMERZBANK AG",null,null,null,null,null,null,null,null,null,null,null,null,null,null,null,null,null,null,"CFS0003",50,"CFS1001",3]
[null,null,null,null,null,null,null,null,null,55,"COMMONWEALTH BANK OF AUSTRALIA",null,null,null,null,null,null,null,null,null,null,null,null,null,null,null,null,null,null,"CFS0004",50,"CFS1001",3]
[null,null,null,null,null,null,null,null,null,56,"COÖPERATIEVE RABOBANK U.A.",null,null,null,null,null,null,null,null,null,null,null,null,null,null,null,null,null,null,"CFS0005",50,"CFS1001",3]
[null,null,null,null,null,null,null,null,null,57,"CREDIT AGRICOLE CORPORATE AND INVESTMENT BANK",null,null,null,null,null,null,null,null,null,null,null,null,null,null,null,null,null,null,"CFS1003",50,"CFS1001",3]
[null,null,null,null,null,null,null,null,null,58,"CREDIT INDUSTRIEL ET COMMERCIAL",null,null,null,null,null,null,null,null,null,null,null,null,null,null,null,null,null,null,"CFS0007",50,"CFS1001",3]
[null,null,null,null,null,null,null,null,null,59,"CREDIT SUISSE AG",null,null,null,null,null,null,null,null,null,null,null,null,null,null,null,null,null,null,"CFS0007A",50,"CFS1001",3]
[null,null,null,null,null,null,null,null,null,60,"CTBC BANK CO., LTD.",null,null,null,null,null,null,null,null,null,null,null,null,null,null,null,null,null,null,"CFS0008",50,"CFS1001",3]
[null,null,null,null,null,null,null,null,null,61,"DAH SING BANK, LIMITED",null,null,null,null,null,null,null,null,null,null,null,null,null,null,null,null,null,null,"CFS0009",50,"CFS1001",3]
[null,null,null,null,null,null,null,null,null,62,"DBS BANK (HONG KONG) LIMITED",null,null,null,null,null,null,null,null,null,null,null,null,null,null,null,null,null,null,"CFS0010",50,"CFS1001",3]
[null,null,null,null,null,null,null,null,null,63,"DBS BANK LTD.",null,null,null,null,null,null,null,null,null,null,null,null,null,null,null,null,null,null,"MCA0001",50,"MCA0001",4]
[null,null,null,null,null,null,null,null,null,64,"DEUTSCHE BANK AKTIENGESELLSCHAFT",null,null,null,null,null,null,null,null,null,null,null,null,null,null,null,null,null,null,"MCARANKING",50,"MCA0001",4]
[null,null,null,null,null,null,null,null,null,65,"DZ BANK AG DEUTSCHE ZENTRAL-GENOSSENSCHAFTSBANK, FRANKFURT AM MAIN",null,null,null,null,null,null,null,null,null,null,null,null,null,null,null,null,null,null,"MCA1104",50,"MCA0001",4]
[null,null,null,null,null,null,null,null,null,66,"E.SUN COMMERCIAL BANK, LTD.",null,null,null,null,null,null,null,null,null,null,null,null,null,null,null,null,null,null,"MCA0002",50,"MCA0001",4]
[null,null,null,null,null,null,null,null,null,67,"EAST WEST BANK",null,null,null,null,null,null,null,null,null,null,null,null,null,null,null,null,null,null,"MCA0003",50,"MCA0001",4]
[null,null,null,null,null,null,null,null,null,68,"EFG BANK AG",null,null,null,null,null,null,null,null,null,null,null,null,null,null,null,null,null,null,"MCA1001",50,"MCA0001",4]
[null,null,null,null,null,null,null,null,null,69,"ERSTE GROUP BANK AG",null,null,null,null,null,null,null,null,null,null,null,null,null,null,null,null,null,null,"MCA1010",50,"MCA0001",4]
[null,null,null,null,null,null,null,null,null,70,"FAR EASTERN INTERNATIONAL BANK",null,null,null,null,null,null,null,null,null,null,null,null,null,null,null,null,null,null,"MCA0004",50,"MCA0001",4]
[null,null,null,null,null,null,null,null,null,71,"FIRST ABU DHABI BANK PJSC",null,null,null,null,null,null,null,null,null,null,null,null,null,null,null,null,null,null,"MCA0005",50,"MCA0001",4]
[null,null,null,null,null,null,null,null,null,72,"FIRST COMMERCIAL BANK, LTD.",null,null,null,null,null,null,null,null,null,null,null,null,null,null,null,null,null,null,"MCA0006",50,"MCA0001",4]
[null,null,null,null,null,null,null,null,null,73,"FUBON BANK (HONG KONG) LIMITED",null,null,null,null,null,null,null,null,null,null,null,null,null,null,null,null,null,null,"MCA0007",50,"MCA0001",4]
[null,null,null,null,null,null,null,null,null,74,"FUSION BANK LIMITED",null,null,null,null,null,null,null,null,null,null,null,null,null,null,null,null,null,null,"MCA0008",50,"MCA0001",4]
[null,null,null,null,null,null,null,null,null,75,"HACHIJUNI BANK, LTD. (THE)",null,null,null,null,null,null,null,null,null,null,null,null,null,null,null,null,null,null,"MCA0009",50,"MCA0001",4]
[null,null,null,null,null,null,null,null,null,76,"HANG SENG BANK, LIMITED",null,null,null,null,null,null,null,null,null,null,null,null,null,null,null,null,null,null,"MCA0010",50,"MCA0001",4]
[null,null,null,null,null,null,null,null,null,77,"HDFC BANK LIMITED",null,null,null,null,null,null,null,null,null,null,null,null,null,null,null,null,null,null,"MCA0011",50,"MCA0001",4]
[null,null,null,null,null,null,null,null,null,78,"HONG LEONG BANK BERHAD",null,null,null,null,null,null,null,null,null,null,null,null,null,null,null,null,null,null,"MCA0012",50,"MCA0001",4]
[null,null,null,null,null,null,null,null,null,79,"HONGKONG AND SHANGHAI BANKING CORPORATION LIMITED (THE)",null,null,null,null,null,null,null,null,null,null,null,null,null,null,null,null,null,null,"ASC1001",60,"ASC1001",5]
[null,null,null,null,null,null,null,null,null,80,"HSBC BANK PLC",null,null,null,null,null,null,null,null,null,null,null,null,null,null,null,null,null,null,"ASC1002",60,"ASC1001",5]
[null,null,null,null,null,null,null,null,null,81,"HSBC BANK USA, NATIONAL ASSOCIATION",null,null,null,null,null,null,null,null,null,null,null,null,null,null,null,null,null,null,"ASC1003",60,"ASC1001",5]
[null,null,null,null,null,null,null,null,null,82,"HUA NAN COMMERCIAL BANK, LTD.",null,null,null,null,null,null,null,null,null,null,null,null,null,null,null,null,null,null,"ASC1004",60,"ASC1001",5]
[null,null,null,null,null,null,null,null,null,83,"HUA XIA BANK CO., LIMITED",null,null,null,null,null,null,null,null,null,null,null,null,null,null,null,null,null,null,"ASC1005",60,"ASC1001",5]
[null,null,null,null,null,null,null,null,null,84,"ICBC STANDARD BANK PLC",null,null,null,null,null,null,null,null,null,null,null,null,null,null,null,null,null,null,"RBCRANKING",20,"RBC0001",6]
[null,null,null,null,null,null,null,null,null,85,"ICICI BANK LIMITED",null,null,null,null,null,null,null,null,null,null,null,null,null,null,null,null,null,null,"RBC0001",20,"RBC0001",6]
[null,null,null,null,null,null,null,null,null,86,"INDIAN OVERSEAS BANK",null,null,null,null,null,null,null,null,null,null,null,null,null,null,null,null,null,null,"RBC0002",20,"RBC0001",6]
[null,null,null,null,null,null,null,null,null,87,"INDUSTRIAL AND COMMERCIAL BANK OF CHINA (ASIA) LIMITED",null,null,null,null,null,null,null,null,null,null,null,null,null,null,null,null,null,null,"RBC0003",20,"RBC0001",6]
[null,null,null,null,null,null,null,null,null,88,"INDUSTRIAL AND COMMERCIAL BANK OF CHINA LIMITED",null,null,null,null,null,null,null,null,null,null,null,null,null,null,null,null,null,null,"RBC0004",20,"RBC0001",6]
[null,null,null,null,null,null,null,null,null,89,"INDUSTRIAL BANK CO., LTD.",null,null,null,null,null,null,null,null,null,null,null,null,null,null,null,null,null,null,"RBC0015",20,"RBC0001",6]
[null,null,null,null,null,null,null,null,null,90,"INDUSTRIAL BANK OF KOREA",null,null,null,null,null,null,null,null,null,null,null,null,null,null,null,null,null,null,"RBC0016",20,"RBC0001",6]
[null,null,null,null,null,null,null,null,null,91,"ING BANK N.V.",null,null,null,null,null,null,null,null,null,null,null,null,null,null,null,null,null,null,"RBC0017",20,"RBC0001",6]
[null,null,null,null,null,null,null,null,null,92,"INTESA SANPAOLO SPA",null,null,null,null,null,null,null,null,null,null,null,null,null,null,null,null,null,null,"RBC0018",20,"RBC0001",6]
[null,null,null,null,null,null,null,null,null,93,"JPMORGAN CHASE BANK, NATIONAL ASSOCIATION",null,null,null,null,null,null,null,null,null,null,null,null,null,null,null,null,null,null,"RBC0019",20,"RBC0001",6]
[null,null,null,null,null,null,null,null,null,94,"KBC BANK N.V.",null,null,null,null,null,null,null,null,null,null,null,null,null,null,null,null,null,null,"RBC0020",20,"RBC0001",6]
[null,null,null,null,null,null,null,null,null,95,"KEB HANA BANK",null,null,null,null,null,null,null,null,null,null,null,null,null,null,null,null,null,null,"RBC0021",20,"RBC0001",6]
[null,null,null,null,null,null,null,null,null,96,"KOOKMIN BANK",null,null,null,null,null,null,null,null,null,null,null,null,null,null,null,null,null,null,"RBC0022",20,"RBC0001",6]
[null,null,null,null,null,null,null,null,null,97,"LAND BANK OF TAIWAN CO., LTD.",null,null,null,null,null,null,null,null,null,null,null,null,null,null,null,null,null,null,"RBC0023",20,"RBC0001",6]
[null,null,null,null,null,null,null,null,null,98,"LGT BANK AG",null,null,null,null,null,null,null,null,null,null,null,null,null,null,null,null,null,null,"RBC0024",20,"RBC0001",6]
[null,null,null,null,null,null,null,null,null,99,"LIVI BANK LIMITED",null,null,null,null,null,null,null,null,null,null,null,null,null,null,null,null,null,null,"FCP0001",20,"FCP0001",9]
[null,null,null,null,null,null,null,null,null,100,"MACQUARIE BANK LIMITED",null,null,null,null,null,null,null,null,null,null,null,null,null,null,null,null,null,null,"FCP0002",20,"FCP0001",9]
[null,null,null,null,null,null,null,null,null,101,"MALAYAN BANKING BERHAD",null,null,null,null,null,null,null,null,null,null,null,null,null,null,null,null,null,null,"FCP0003",20,"FCP0001",9]
[null,null,null,null,null,null,null,null,null,102,"MASHREQ BANK - PUBLIC SHAREHOLDING COMPANY",null,null,null,null,null,null,null,null,null,null,null,null,null,null,null,null,null,null,"FCP0004",20,"FCP0001",9]
[null,null,null,null,null,null,null,null,null,103,"MEGA INTERNATIONAL COMMERCIAL BANK CO., LTD.",null,null,null,null,null,null,null,null,null,null,null,null,null,null,null,null,null,null,"FCP0005",20,"FCP0001",9]
[null,null,null,null,null,null,null,null,null,104,"MELLI BANK PLC",null,null,null,null,null,null,null,null,null,null,null,null,null,null,null,null,null,null,"FCP0006",20,"FCP0001",9]
[null,null,null,null,null,null,null,null,null,105,"MITSUBISHI UFJ TRUST AND BANKING CORPORATION",null,null,null,null,null,null,null,null,null,null,null,null,null,null,null,null,null,null,"FCP0007",20,"FCP0001",9]
[null,null,null,null,null,null,null,null,null,106,"MIZUHO BANK, LTD.",null,null,null,null,null,null,null,null,null,null,null,null,null,null,null,null,null,null,"FCP0008",20,"FCP0001",9]
[null,null,null,null,null,null,null,null,null,107,"MORGAN STANLEY BANK ASIA LIMITED",null,null,null,null,null,null,null,null,null,null,null,null,null,null,null,null,null,null,"FCP0009",20,"FCP0001",9]
[null,null,null,null,null,null,null,null,null,108,"MOX BANK LIMITED",null,null,null,null,null,null,null,null,null,null,null,null,null,null,null,null,null,null,"FCP0010",20,"FCP0001",9]
[null,null,null,null,null,null,null,null,null,109,"MUFG BANK, LTD.",null,null,null,null,null,null,null,null,null,null,null,null,null,null,null,null,null,null,"FCP0011",20,"FCP0001",9]
[null,null,null,null,null,null,null,null,null,110,"NANYANG COMMERCIAL BANK, LIMITED",null,null,null,null,null,null,null,null,null,null,null,null,null,null,null,null,null,null,"LRC0001",30,"LRC0001",11]
[null,null,null,null,null,null,null,null,null,111,"NATIONAL AUSTRALIA BANK LIMITED",null,null,null,null,null,null,null,null,null,null,null,null,null,null,null,null,null,null,"LRC0002",30,"LRC0001",11]
[null,null,null,null,null,null,null,null,null,112,"NATIONAL BANK OF PAKISTAN",null,null,null,null,null,null,null,null,null,null,null,null,null,null,null,null,null,null,"LCC0102C",3,"LCC0102A",1]
[null,null,null,null,null,null,null,null,null,113,"NATIXIS",null,null,null,null,null,null,null,null,null,null,null,null,null,null,null,null,null,null,"MCA0021",30,"MCA0021",7]
[null,null,null,null,null,null,null,null,null,114,"NATWEST MARKETS PLC",null,null,null,null,null,null,null,null,null,null,null,null,null,null,null,null,null,null,"MCA0022",30,"MCA0021",7]
[null,null,null,null,null,null,null,null,null,115,"O-BANK CO., LTD.",null,null,null,null,null,null,null,null,null,null,null,null,null,null,null,null,null,null,"MCA0023",30,"MCA0021",7]
[null,null,null,null,null,null,null,null,null,116,"OCBC WING HANG BANK LIMITED",null,null,null,null,null,null,null,null,null,null,null,null,null,null,null,null,null,null,"MCA0024",30,null,7]
[null,null,null,null,null,null,null,null,null,117,"OVERSEA-CHINESE BANKING CORPORATION LIMITED",null,null,null,null,null,null,null,null,null,null,null,null,null,null,null,null,null,null,"MCA0025",30,null,7]
[null,null,null,null,null,null,null,null,null,118,"PHILIPPINE NATIONAL BANK"]
[null,null,null,null,null,null,null,null,null,119,"PICTET & CIE (EUROPE) S.A."]
[null,null,null,null,null,null,null,null,null,120,"PING AN BANK CO., LTD."]
[null,null,null,null,null,null,null,null,null,121,"PING AN ONECONNECT BANK (HONG KONG) LIMITED"]
[null,null,null,null,null,null,null,null,null,122,"PT. BANK NEGARA INDONESIA (PERSERO) TBK."]
[null,null,null,null,null,null,null,null,null,123,"PUBLIC BANK (HONG KONG) LIMITED"]
[null,null,null,null,null,null,null,null,null,124,"PUNJAB NATIONAL BANK"]
[null,null,null,null,null,null,null,null,null,125,"QATAR NATIONAL BANK (Q.P.S.C.)"]
[null,null,null,null,null,null,null,null,null,126,"ROYAL BANK OF CANADA"]
[null,null,null,null,null,null,null,null,null,127,"SHANGHAI COMMERCIAL & SAVINGS BANK, LTD. (THE)"]
[null,null,null,null,null,null,null,null,null,128,"SHANGHAI COMMERCIAL BANK LIMITED"]
[null,null,null,null,null,null,null,null,null,129,"SHANGHAI PUDONG DEVELOPMENT BANK CO., LTD."]
[null,null,null,null,null,null,null,null,null,130,"SHIGA BANK, LTD. (THE)"]
[null,null,null,null,null,null,null,null,null,131,"SHINHAN BANK"]
[null,null,null,null,null,null,null,null,null,132,"SHIZUOKA BANK, LTD. (THE)"]
[null,null,null,null,null,null,null,null,null,133,"SKANDINAVISKA ENSKILDA BANKEN AB"]
[null,null,null,null,null,null,null,null,null,134,"SOCIETE GENERALE"]
[null,null,null,null,null,null,null,null,null,135,"STANDARD CHARTERED BANK"]
[null,null,null,null,null,null,null,null,null,136,"STANDARD CHARTERED BANK (HONG KONG) LIMITED"]
[null,null,null,null,null,null,null,null,null,137,"STATE BANK OF INDIA"]
[null,null,null,null,null,null,null,null,null,138,"STATE STREET BANK AND TRUST COMPANY"]
[null,null,null,null,null,null,null,null,null,139,"SUMITOMO MITSUI BANKING CORPORATION"]
[null,null,null,null,null,null,null,null,null,140,"SUMITOMO MITSUI TRUST BANK, LIMITED"]
[null,null,null,null,null,null,null,null,null,141,"SVENSKA HANDELSBANKEN AB (PUBL)"]
[null,null,null,null,null,null,null,null,null,142,"TAI SANG BANK LIMITED"]
[null,null,null,null,null,null,null,null,null,143,"TAI YAU BANK, LIMITED"]
[null,null,null,null,null,null,null,null,null,144,"TAIPEI FUBON COMMERCIAL BANK CO., LTD."]
[null,null,null,null,null,null,null,null,null,145,"TAISHIN INTERNATIONAL BANK CO., LTD"]
[null,null,null,null,null,null,null,null,null,146,"TAIWAN BUSINESS BANK, LTD."]
[null,null,null,null,null,null,null,null,null,147,"TAIWAN COOPERATIVE BANK, LTD."]
[null,null,null,null,null,null,null,null,null,148,"TAIWAN SHIN KONG COMMERCIAL BANK CO., LTD."]
[null,null,null,null,null,null,null,null,null,149,"TORONTO-DOMINION BANK"]
[null,null,null,null,null,null,null,null,null,150,"UBS AG"]
[null,null,null,null,null,null,null,null,null,151,"UCO BANK"]
[null,null,null,null,null,null,null,null,null,152,"UNICREDIT BANK AG"]
[null,null,null,null,null,null,null,null,null,153,"UNION BANCAIRE PRIVÉE, UBP SA"]
[null,null,null,null,null,null,null,null,null,154,"UNION BANK OF INDIA"]
[null,null,null,null,null,null,null,null,null,155,"UNITED OVERSEAS BANK LTD."]
[null,null,null,null,null,null,null,null,null,156,"WELAB BANK LIMITED"]
[null,null,null,null,null,null,null,null,null,157,"WELLS FARGO BANK, NATIONAL ASSOCIATION"]
[null,null,null,null,null,null,null,null,null,158,"WESTPAC BANKING CORPORATION"]
[null,null,null,null,null,null,null,null,null,159,"WOORI BANK"]
[null,null,null,null,null,null,null,null,null,160,"YUANTA COMMERCIAL BANK CO., LTD"]
[null,null,null,null,null,null,null,null,null,161,"ZA BANK LIMITED"]
[null,null,null,null,null,null,null,null,null,901,"Other authorized financial institution"]
[null,null,null,null,null,null,null,null,null,902,"Other financial institution in Hong Kong"]
[null,null,null,null,null,null,null,null,null,920,"Overseas financial institution"]

{"sheet":"Error Message","index":24,"n_rows":362,"n_cols":2,"rows_kept":362,"cut":false,"hidden":true,"merged":[]}
["Error Message ID","Error Message"]
[100,"Please select whether the financial return is monthly or semi-annual return in Form 1."]
[101,"Please enter the name of the licensed corporation in Form 1 Item 1."]
[102,"Please enter the CE number in Form 1 Item 1."]
[103,"Please enter the CE number in form of XXX999 (i.e. 3 alphabets + 3 numbers)."]
[104,"Please select reporting month in Form 1 - Item 3."]
[105,"Please select the type(s) of regulated activity(ies) for which the licensed corporation is licensed in Form 1 Item 4."]
[106,"{1} is already opened, please close it and try again."]
[107,"Process Submitted Spreadsheet Failure"]
[108,"Can't reset all fields"]
[109,"File exported successfully.{1}{2}{3}"]
[110,"Error occurred during Export Data File, export aborted!{1}{2}{3}"]
[111,"Message"]
[112,"File import failure{1}{2}Please close this workbook without save, and try import Data File again."]
[113,"Validation failure, export Data File aborted!"]
[114,"Process Submitted Spreadsheet Failure"]
[115,"Passed Form 1 validations."]
[116,"Validation failure, export aborted!{1}"]
[117,"Export Data File Failure"]
[118,"Error occurred during Export Data File, export aborted!"]
[120,"File imported successfully."]
[121,"Import Data File will overwrite ALL existing data on the spreadsheet.{1}{2}Continue?"]
[122,"Required liquid capital reported in Form 1 - {1} does not equal to required liquid capital reported in Form 2 - Item {2}."]
[124,"Form 1 shows that the amount of shareholders' funds reported in Item 18 (Field 1106) does not equal to total shareholders' funds reported in Note 8 (Field 1116)."]
[126,"Form 1 Item 5 Bank balances held in other accounts and cash in hand included in liquid asset (Field 1009) does not equal to the amount reported in Form 1 Note 4 (Field 1110)."]
[128,"Form 1 shows that the amount of shareholders' funds reported in Item 38 (Field 1106) is different from the net of Item 21 total assets (Field 1054) and Item 32 total liabilities (Field 1100)."]
[131,"Please select on which calculation basis the margin shortfall is accounted for in Form 1 Note 5."]
[132,"Please enter the name of the person signing the declaration in the page of declaration."]
[133,"Please indicate the capacity of the person signing the declaration in the page of declaration."]
[134,"Please enter the date of signing the financial return in the page of declaration."]
[135,"Form 1 contains data, but the submission is not declared in the page of declaration."]
[136,"Form 2 contains data, but the submission is not declared in the page of declaration."]
[137,"Form 3 contains data, but the submission is not declared in the page of declaration."]
[138,"Form 4 contains data, but the submission is not declared in the page of declaration."]
[139,"Form 5 contains data, but the submission is not declared in the page of declaration."]
[140,"Form 6 contains data, but the submission is not declared in the page of declaration."]
[141,"Form 7 contains data, but the submission is not declared in the page of declaration."]
[142,"Form 8 contains data, but the submission is not declared in the page of declaration."]
[143,"Form 9 contains data, but the submission is not declared in the page of declaration."]
[144,"Form 10 contains data, but the submission is not declared in the page of declaration."]
[145,"Form 11 contains data, but the submission is not declared in the page of declaration."]
[146,"Form 12 contains data, but the submission is not declared in the page of declaration."]
[200,"Please select the type(s) of regulated activity(ies) for which the licensed corporation is licensed in Form 1, for generating the floor requirement in Form 2 - Item - {1}."]
[201,"Passed Form 2 validations."]
[202,"Please enter the amount of required liquid capital in Field 2013 in Form 2."]
[300,"Please select credit facility group in row {1} in Form 3."]
[302,"Please specify the detail of the financial institution, the credit type and the maturity/expiry date of the credit facility in row {1} in Form 3."]
[303,"Please specify the detail of the financial institution in row {1} in Form 3."]
[304,"Please specify the credit type of the credit facility in row {1} in Form 3."]
[305,"Please specify the maturity/expiry date of the credit facility in row {1} in Form 3."]
[306,"Please specify the detail of the financial institution, the credit type and the maturity/expiry date of the credit facility in row {1} in Form 3."]
[307,"Please specify the detail of the financial institution in row {1} in Form 3."]
[308,"Please specify the credit type of the credit facility in row {1} in Form 3."]
[309,"Please specify the maturity/expiry date of the credit facility in row {1} in Form 3."]
[310,"Please input data in row {1} before filling in row {2} in Form 3."]
[311,"Please specify the security code and type in row {1} in Form 3."]
[312,"Passed Form 3 validations."]
[400,"Please specify the client name in row {1} in Form 4 Table 1."]
[402,"Please specify the stock code / sedol no. / ISIN code of collateral 1 in row {1} in Form 4 Table 1."]
[403,"Please specify the name of collateral 1 in row {1} in Form 4 Table 1."]
[404,"Please specify the stock code / sedol no. / ISIN code of collateral 2 in row {1} in Form 4 Table 1."]
[405,"Please specify the name of collateral 2 in row {1} in Form 4 Table 1."]
[406,"Please specify the stock code / sedol no. / ISIN code of collateral 3 in row {1} in Form 4 Table 1."]
[407,"Please specify the name of collateral 3 in row {1} in Form 4 Table 1."]
[408,"Repeated stock codes / sedol numbers / ISIN code are found in row {1} in Form 4 Table 1."]
[409,"Adjusted loan balance in row {1} should not exceed the corresponding unadjusted loan balance in the same row in Form 4 Table 1."]
[411,"Total unadjusted loan balance [cell {1}] in Form 4 Table 1 does not equal to the amounts receivable from margin clients reported in balance sheet [cell {2}] in Form 1 - {3}."]
[413,"Total adjusted loan balance [cell {1}] in Form 4 Table 1 does not equal to amounts receivable from margin clients included in liquid capital computation [cell {2}] in Form 1 - {3}."]
[415,"Passed Form 4 Table 1 validations."]
[416,"Please specify the client name in row {1} in Form 4 Table 2."]
[417,"Please specify group number in row {1} in Form 4 Table 2."]
[418,"Passed Form 4 Table 2 validations."]
[419,"Please input data in row {1} before filling in row {2} in Form 4 Table 1."]
[420,"Please input data in row {1} before filling in row {2} in Form 4 Table 2."]
[421,"Please specify the client name in row {1} in Form 4 Table 2."]
[422,"Passed Form 4 Table 3 validations."]
[500,"Please specify the concentration discounting factor in row {1} in Form 5."]
[502,"Please specify stock code / sedol number / ISIN code in row {1} in Form 5."]
[503,"Please specify the name and stock code / sedol number / ISIN code of the securities collateral in row {1} in Form 5."]
[504,"Please input the concentration discounting factor in row {1} in Form 5."]
[505,"Concentration discounting factor is greater than 1 in Form 5."]
[506,"Passed Form 5 validations."]
[507,"Please input data in row {1} before filling in row {2} in Form 5."]
[600,"Please specify the client name in row {1} in Form 6."]
[602,"Adjusted balance in row {1} should not exceed the corresponding account balance in the same row in Form 6."]
[604,"Total account balance (Field {1}) in Form 6 does not equal to the amounts receivable from rolling balance cash clients included in balance sheet (Field {2}) in Form 1- Item 8."]
[606,"Total adjusted balance (Field {1}) in Form 6 does not equal to the amounts receivable from rolling balance cash clients reported in liquid capital computation (Field {2}) in Form 1- Item 8."]
[608,"Passed Form 6 validations."]
[609,"Please input data in row {1} before filling in row {2} in Form 6."]
[700,"Please specify the nature of other trading profit and loss in cell {1} for the amount reported in cell {2} in Form 7."]
[703,"Please specify the nature of other income in cell {1} for the amount reported in cell {2} in Form 7."]
[704,"Please specify the nature of other overhead in cell {1} for the amount reported in cell {2} in Form 7."]
[705,"The amount of retained profits/(accumulated losses) for the current month reported in cell {1} for the amount reported in cell {2} in Form 7."]
[708,"Form 7 shows that the amount of interest income is material, please provide details of the interest income in Note 6."]
[709,"The amount of interest income reported in cell {1} should equal to the amount reported in cell {2} in Form 7."]
[711,"Please specify the nature of other interest income in cell {1} for the amount reported in cell {2} in Form 7."]
[712,"Form 7 shows that the amount of interest expense is material, please provide details of the interest expense in Note 6."]
[713,"The amount of interest expense reported in cell {1} should equal to the amount reported in cell {2} in Form 7."]
[714,"Passed Form 7 validations."]
[800,"Please select on which basis the client securities are accounted for in Note 1 of Form 8 Table 1."]
[801,"Please specify the nature of other client securities in Field {1} for the client securities reported in Field {2} in Form 8 Table 1."]
[804,"Please specify the CCASS sub-account number(s) of segregated account(s) designated for cash clients in Field {1} in Form 8 Table 1."]
[805,"Please specify the CCASS sub-account number(s) of segregated account(s) designated for margin clients in Field {1} in Form 8 Table 1."]
[806,"Please specify the sub-account number(s) and purpose(s) of the client securities kept in other CCASS sub-account(s) in Field {1} and Field {2} for the client securities reported in Field {3} in Form 8 Table 1."]
[807,"Please specify the name of the associated entity(ies) by which the client securities are held in Field {1} in Form 8 Table 1."]
[808,"Please specify the location(s) of the client securities and the purpose(s) of the disposition(s) in Form 8 Table 1 Note 3 for the client securities reported in Field {1}."]
[809,"Total amounts payable to clients reported in Field {1} in Form 8 Table 2 does not equal to that reported in Form 1 (Field {2})."]
[811,"Please specify the nature of the amounts payable to other clients in Field {1} for the amounts payable to clients reported in Field(s) {2} and/or {3} in Form 8 Table 2."]
[815,"Please specify where the client segregated funds are held in Field {1} for the amount of segregated funds reported in Field(s) {2} and/or {3} in Form 8 Table 2."]
[817,"Please explain in Field {1} in Form 8 Table 2 for the circumstance(s) leading to (a) total segregated fund for calculating ranking liabilities exceeding total amount payable to clients in Form 8 Table 2 (i.e. cell {2} > cell {3}); (b) difference between ranking liabilities computed in cell {4} and amount of ranking liabilities included in item 23 of Form 1 (i.e.cell {5}); and/or (c) excess or deficiency in segregated funds in Field {6} in Form 8 Table 2."]
[819,"Passed Form 8 Table 1 validations."]
[820,"Passed Form 8 Table 2 validations."]
[900,"Please specify the foreign currency position for the type of the foreign currency reported in row {1} in Form 9."]
[902,"Positions for the same foreign currency in row {1} and {2} should not be reported in separate rows in Form 9."]
[904,"Please specify the type of the foreign currency for the foreign currency position reported in row {1} in Form 9."]
[906,"Assets & amounts of foreign currency in which the licensed corporation is exposed to the risk of a decline in the value of the foreign currency under outstanding contracts with recognized counterparty in row {1} should not exceed the sum of (A) assets and (C) amounts of foreign currency in which the licensed corporation is exposed to the risk of a decline in the value of the foreign currency under outstanding contracts of the same row in Form 9."]
[908,"Liabilities & amounts of foreign currency in which the licensed corporation is exposed to the risk of a rise in the value of the foreign currency under outstanding contracts with recognized counterparty in row {1} should not exceed the sum of (B) liabilities and (D) amounts of foreign currency in which the licensed corporation is exposed to the risk of a rise in the value of the foreign currency of the same row in Form 9."]
[910,"Reported gross foreign currency position in row {1} should not exceed the sum of (A) assets, (B) liabilities, (C) amounts of foreign currency in which the licensed corporation is exposed to the risk of a decline in the value of the foreign currency and (D) amounts of foreign currency in which the licensed corporation is exposed to the risk of a rise in the value of the foreign currency of the same row in Form 9."]
[912,"Reported aggregate gross foreign currency position in row {1} should not exceed the reported gross foreign currency position of the same row in Form 9."]
[914,"The amount of 1.5% of aggregate gross foreign currency positions in cell {1} in Form 9 should equal to cell {2} in Form 2."]
[917,"Passed Form 9 validations."]
[1000,"Please specify other OTC contracts in Field {1} in Form 10 Table 1."]
[1002,"Please specify other Exchange-traded contracts in Field {1} in Form 10 Table 1."]
[1003,"Passed Form 10 Table 1 validations."]
[1004,"Passed Form 10 Table 2 validations."]
[1005,"Passed Form 10 Table 3 validations."]
[1006,"Passed Form 10 Table 4 validations."]
[1007,"Passed Form 10 Table 5 validations."]
[1008,"Passed Form 10 Table 6 validations."]
[1100,"Please input data in row {1} before filling in row {2} in Form 11."]
[1103,"Please enter the qualifying criterion for the recognized counterparty in row {1} in Form 11."]
[1104,"Please enter the name of recognized counterparty in row {1} in Form 11."]
[1105,"Please fill in Form 11 for the information about the recognized counterparty(ies) with whom the foreign currency positions are held."]
[1106,"Passed Form 11 validations."]
[1200,"Please enter the number of active cash clients in Field C100A and/or number of active rolling balance cash clients in Field C100B in Form 12."]
[1202,"Please enter the number of active margin clients in Field {1} in Form 12."]
[1203,"Please enter the number of active futures and options clients in Field {1} in Form 12."]
[1204,"Please enter the number of active leveraged foreign exchange trading clients in Field {1} in Form 12."]
[1205,"Please enter the number of clients to whom the licensed corporation provides advising on securities, futures contracts services and/or corporate finance services and/or asset management services in Form 12."]
[1206,"Passed Form 12 validations."]
[1207,"Please specify Securities Type!"]
[1208,"Invalid Data Entry"]
[1209,"Please select Currency Code from the list!"]
[1210,"Please specify the name of the financial institution!"]
[1211,"Please specify nature of the credit facility!"]
[1212,"For licensed corporations submitting financial return on monthly basis, please ensure that Form 10, Form 11 and/or Form 12 is/are properly reported as appropriate for the current reporting month of this financial return."]
[1213,"Warning"]
[1214,"Please specify type of currency!"]
[1215,"Form 1 Item 18 Other assets arising from advising on securities and/or futures contracts - the amount included in liquid asset (Field 1043) is larger than the amount reported in balance sheet (Field 1044) by ${1}K."]
[1216,"Form 1 shows an amount reported in Item 18 Other assets arising from advising on securities and/or futures contracts (Field 1043 and/or 1044) which is inconsistent with the regulated activities reported by the licensed corporation."]
[1217,"Form {1} is/are submitted, but it/they should not be required for the licensed corporation which is only licensed for advising on securities, futures contracts, corporate finance and/or asset management, and is subjected to specified licensing condition. Please check whether the submission is appropriate."]
[1218,"Form 1 Item 18 Other assets arising from advising on corporate finance - the amount included in liquid asset (Field 1045) is larger than the amount reported in balance sheet (Field 1046) by ${1}K."]
[1219,"Form 1 shows an amount reported in Item 18 Other assets arising from advising on corporate finance (Field 1045 and/or 1046) which is inconsistent with the regulated activities reported by the licensed corporation."]
[1220,"Form 1 Item 13 Amounts receivable from clients arising from trading in exchange-traded unlisted options contracts - the amount included in liquid asset (Field 1025) is larger than the amount reported in balance sheet (Field 1026) by ${1}K."]
[1221,"Form 1 Item 15 Amounts receivable from other dealers and clearing participants in respect of futures, unlisted options and leverage foreign exchange contracts - the amount included in liquid asset (Field 1029) is larger than the amount reported in balance sheet (Field 1030) by ${1}K."]
[1222,"Form 1 Item 16 Amounts receivable from SEOCH - the amount included in liquid asset (Field 1033) is larger than the amount reported in balance sheet (Field 1034) by ${1}K."]
[1223,"Form 1 Item 16 Amounts receivable from HKFECC - the amount included in liquid asset (Field 1035) is larger than the amount reported in balance sheet (Field 1036) by ${1}K."]
[1224,"Form 1 Item 25 Amounts payable to SEOCH - the amount included in ranking liabilities (Field 1063) is smaller than the amount reported in balance sheet (Field 1064) by ${1}K."]
[1225,"Form 1 Item 25 Amounts payable to HKFECC - the amount included in ranking liabilities (Field 1065) is smaller than the amount reported in balance sheet (Field 1066) by ${1}K."]
[1226,"Form 1 Item 27 Amounts payable to other dealers and clearing participants in respect of dealing in futures and unlisted options contracts - the amount included in ranking liabilities (Field 1073) is smaller than the amount reported in balance sheet (Field 1074) by ${1}K."]
[1227,"Form 1 shows an amount reported in Item 25 Amounts payable to HKFECC (Field 1065 and/or 1066) which is inconsistent with the regulated activities reported by the licensed corporation."]
[1228,"Form 1 shows an amount reported in Item 16 Amounts receivable from HKFECC (Field 1035 and/or 1036) which is inconsistent with the regulated activities reported by the licensed corporation."]
[1229,"Form 1 Item 18 Other assets arising from others - the amount included in liquid asset (Field 1050) is larger than the amount reported in balance sheet (Field 1051) by ${1}K."]
[1230,"Form 1 Item 7 Amounts receivable from clients for subscription of securities - the amount included in liquid asset (Field 1013) is larger than the amount reported in balance sheet (Field 1014) by ${1}K."]
[1231,"Form 1 Item 9 Other amounts receivable from clients arising from dealing in securities - the amount included in liquid assets (Field 1017) is larger than the amount reported in balance sheet (Field 1018) by ${1}K. "]
[1232,"Form 1 Item 14 - Amounts receivable from other dealers and clearing participants etc. in respect of securities - the amount included in liquid assets (Field 1027) is larger than the amount reported in balance sheet (Field 1028) by ${1}K. "]
[1233,"Form 1 Item 16 Amounts receivable from HKSCC - the amount included in liquid asset (Field 1031) is larger than the amount reported in balance sheet (Field 1032) by ${1}K."]
[1234,"Form 1 Item 16 Amounts receivable from Euroclear, Clearstream and Korea Securities Finance Corporation - the amount included in liquid asset (Field 1037) is larger than the amount reported in balance sheet (Field 1038) by ${1}K."]
[1235,"Form 1 Item 16 Amounts receivable from other clearing houses - the amount included in liquid asset (Field 1039) is larger than the amount reported in balance sheet (Field 1040) by ${1}K."]
[1236,"Form 1 Item 25 Amounts payable to HKSCC - the amount included in ranking liabilities (Field 1061) is smaller than the amount reported in balance sheet (Field 1062) by ${1}K."]
[1237,"Form 1 Item 25 Amounts payable to Euroclear, Clearstream and Korea Securities Finance Corporation - the amount included in ranking liabilities (Field 1067) is smaller than the amount reported in balance sheet (Field 1068) by ${1}K."]
[1238,"Form 1 Item 25 Amounts payable to other clearing houses - the amount included in ranking liabilities (Field 1069) is smaller than the amount reported in balance sheet (Field 1070) by ${1}K."]
[1239,"Form 1 shows an amount reported in Item 6 Amounts receivable from margin clients (Field 1011 and/or 1012) which is inconsistent with the regulated activities reported by the licensed corporation."]
[1240,"Form 1 shows an amount reported in Item 7 Amounts receivable from clients for subscription of securities (Field 1013 and/or 1014) which is inconsistent with the regulated activities reported by the licensed corporation."]
[1241,"Form 1 shows an amount reported in Item 8 Amounts receivable from rolling balance cash clients (Field 1015 and/or 1016) which is inconsistent with the regulated activities reported by the licensed corporation."]
[1242,"Form 1 shows an amount reported in Item 9 Other amounts receivable from clients arising from dealing in securities (Field 1017 and/or 1018) which is inconsistent with the regulated activities reported by the licensed corporation."]
[1243,"Form 1 shows an amount reported in Item 10 Amounts receivable from licensed corporation licensed for securities margin financing (Field 1019 and/or 1020) which is inconsistent with the regulated activities reported by the licensed corporation."]
[1244,"Form 1 shows an amount reported in Item 25 Amounts payable to HKSCC (Field 1061 and/or 1062) which is inconsistent with the regulated activities reported by the licensed corporation."]
[1245,"Form 1 shows an amount reported in Item 25 Amounts payable to SEOCH (Field 1063 and/or 1064) which is inconsistent with the regulated activities reported by the licensed corporation."]
[1246,"Form 1 shows an amount reported in Item 25 Amounts payable to Euroclear, Clearstream and Korea Finance Corporation (Field 1067 and/or 1068) which is inconsistent with the regulated activities reported by the licensed corporation."]
[1247,"Form 1 shows an amount reported in Item 26 Amounts payable to licensed corporations licensed for securities margin financing and other securities dealers in respect of dealing in securities (Field 1071 and/or 1072) which is inconsistent with the regulated activities reported by the licensed corporation."]
[1248,"Form 1 Item 28 Other payables and liabilities (accruals, amounts payable and other liabilities other than approved subordinated loan) - the amount included in ranking liabilities (Field 1081) is smaller than the amount reported in balance sheet (Field 1082) by ${1}K."]
[1249,"Form 1 shows an amount reported in Item 18 Other assets arising from asset management (Field 1047 and/or 1048) which is inconsistent with the regulated activities reported by the licensed corporation."]
[1250,"Form 1 Item 18 Other assets arising from asset management - the amount included in liquid asset (Field 1047) is larger than the amount reported in balance sheet (Field 1048) by ${1}K."]
[1251,"Form 1 Item 5 Bank balances held in other accounts and cash in hand - the amount included in liquid asset (Field 1009) is larger than the amount reported in balance sheet (Field 1010) by ${1}K."]
[1253,"Form 1 shows an amount reported in Item 23 Amounts payable to clients (Field 1057 and/or 1058) which is inconsistent with the regulated activities reported by the licensed corporation."]
[1254,"Form 1 Item 22 Short positions in securities and investments held for own account - the amount included in ranking liabilities (Field 1055) is smaller than the amount reported in balance sheet (Field 1056) by ${1}K."]
[1255,"Form 1 Item 28 Other payables and liabilities (loans and overdrafts from authorized financial institutions) - the amount included in ranking liabilities (Field 1075) is smaller than the amount reported in balance sheet (Field 1076) by ${1}K."]
[1256,"Form 1 Item 28 Other payables and liabilities (loans and overdrafts from other financial institutions) - the amount included in ranking liabilities (Field 1077) is smaller than the amount reported in balance sheet (Field 1078) by ${1}K."]
[1257,"Form 1 Item 17 Amounts receivable from recognized counterparties and floating profits in respect of open positions arising from leveraged foreign exchange trading - the amount included in liquid asset (Field 1041) is larger than the amount reported in balance sheet (Field 1042) by ${1}K."]
[1258,"Form 1 shows an amount reported in Item 17 Amounts receivable from recognized counterparties and floating profits in respect of open positions arising from leveraged foreign exchange trading (Field 1041 and/or 1042) which is inconsistent with the regulated activity reported by the licensed corporation."]
[1259,"Form 7 (Profit and Loss Account) is not submitted."]
[1260,"Reporting date does not fall within 7 days before or after the calendar month-end date.  "]
[1261,"Form 1 Item 8 Amounts receivable from rolling balance cash clients – the amount included in liquid assets (Field 1015) is larger than the amount reported in balance sheet (Field 1016) by ${1}K.  "]
[1262,"Form 1 Item 6 Amounts receivable from margin clients – the amount included in liquid assets (Field 1011) is larger than the amount reported in balance sheet (Field 1012) by ${1}K. "]
[1263,"Form 1 Item 10 Amounts receivable from licensed corporations licensed for securities margin financing - the amount included in liquid assets (Field 1019) is larger than the amount reported in balance sheet (Field 1020) by ${1}K. "]
[1264,"Form 1 Item 24 Amounts payable to securities dealer arising from provision of securities margin financing to common clients - the amount included in ranking liabilities (Field 1059) is smaller than the amount reported in balance sheet (Field 1060) by ${1}K."]
[1265,"Form 1 Item 26 Amounts payable to licensed corporations licensed for securities margin financing and other securities dealers in respect of dealing in securities - the amount included in ranking liabilities (Field 1071) is smaller than the amount reported in balance sheet (Field 1072) by ${1}K."]
[1266,"Form 1 shows an amount reported in Item 10 Amounts receivable from licensed corporations licensed for securities margin financing (Field 1019 and/or 1020) which is inconsistent with the regulated activities reported by the licensed corporation."]
[1267,"Form 1 shows an amount reported in Item 13 Amounts receivable from clients arising from dealing in exchange-traded unlisted options contracts (Field 1025 and/or 1026) which is inconsistent with the regulated activities reported by the licensed corporation."]
[1268,"Form 1 shows an amount reported in Item 15 Amounts receivable from other dealers and clearing participants in respect of futures, unlisted options and leverage foreign exchange contracts (Field 1029 and/or 1030) which is inconsistent with the regulated activities reported by the licensed corporation."]
[1269,"Form 1 shows an amount reported in Item 16 Amounts receivable from clearing houses which is inconsistent with the regulated activities reported by the licensed corporation."]
[1270,"Form 1 shows an amount reported in Item 25 Amounts payable to clearing houses which is inconsistent with the regulated activities reported by the licensed corporation."]
[1271,"Form 1 shows an amount reported in Item 27 Amounts payable to other dealers and clearing participants in respect of dealing in futures and unlisted options contracts (Field 1073 and/or 1074) which is inconsistent with the regulated activities reported by the licensed corporation."]
[1272,"Form 1 shows an amount reported in Item 31 Ranking liabilities relating to insufficient margin received for leveraged foreign exchange trading (Field 1098) which is inconsistent with the regulated activity reported by the licensed corporation."]
[1273,"Please fill out Note 8 and/or Note 11 of Form 1 for Ranking liabilities relating to securities borrowing and lending and repurchase transactions (Field 1092) reported in Form 1 Item 31."]
[1274,"Form 1 Item 29 Provisions for contingent liabilities and floating losses - the amount included in ranking liabilities (Field 1083) is smaller than the amount reported in balance sheet (Field 1084) by ${1}K."]
[1275,"Form 2 reports an on-balance sheet liabilities (Field 2001) which is different from the total liabilities reported in Form 1 (Field 1100) by ${1}K.  Please check whether the two items are properly reported."]
[1276,"Form 2 reports initial margin requirements or amounts of margin required to be deposited in respect of outstanding futures and unlisted options contracts held on behalf of clients but there is no turnover in futures and options contracts for client account.  "]
[1277,"Approved subordinated loan reported in Form 1 does not equal to that reported in Form 2 and shows a difference of ${1}K. "]
[1278,"Form 8 is submitted but no data is reported."]
[1279,"Form 1 Item 28 Other payables and liabilities (amounts payable to group companies or other related parties) - the amount included in ranking liabilities (Field 1079) is smaller than the amount reported in balance sheet (Field 1080) by ${1}K."]
[1280,"Form 10 is not submitted for the reporting month of March, June, September or December."]
[1281,"Form 12 is not submitted for the reporting month of March, June, September or December."]
[1282,"Form 3 is submitted but no data is reported. "]
[1283,"Form 9 is submitted but no data is reported.  "]
[1284,"Form 11 is submitted but no data is reported.  "]
[1285,"Form 1 shows an amount reported in Item 16 Amounts receivable from HKSCC (Field 1031 and/or 1032) which is inconsistent with the regulated activities reported by the licensed corporation."]
[1286,"Form 1 shows an amount reported in Item 16 Amounts receivable from SEOCH (Field 1033 and/or 1034) which is inconsistent with the regulated activities reported by the licensed corporation."]
[1287,"Form 1 shows an amount reported in Item 16 Amount receivable from Euroclear, Clearstream and Korea Finance Corporation (Field 1037 and/or 1038) which is inconsistent with the regulated activities reported by the licensed corporation."]
[1288,"Form 1 shows an amount reported in Item 24 Amounts payable to securities dealers arising from provision of securities margin financing to common clients (Field 1059 and/or 1060) which is inconsistent with the regulated activities reported by the licensed corporation."]
[1289,"Form 7 is submitted but no data is reported.  "]
[1290,"Paid-up share capital of ${1}K is lower than the required level of $30M for leveraged foreign exchange trading. "]
[1291,"Paid-up share capital of ${1}K is lower than the required level of $10M for securities dealer providing securities margin financing, for securities margin financier and/or for licensed corporation licensed for advising on corporate finance not subject to no sponsor work licensing condition."]
[1292,"Paid-up share capital of ${1}K is lower than the required level of $5M."]
[1293,"Total adjusted balance (Field 6010) in Form 6 does not equal to amounts receivable from rolling balance cash clients reported in liquid capital computation (Field 1015) in Form 1."]
[1294,"Total account balance (Field 6008) in Form 6 does not equal to amounts receivable from rolling balance cash clients reported in balance sheet (Field 1016) in Form 1."]
[1295,"Form 6 is submitted but no data is reported. "]
[1296,"Total adjusted loan balance (Field 4010) in Form 4 Table 1 does not equal to amounts receivable from margin clients reported in liquid capital computation (Field 1011) in Form 1."]
[1297,"Total unadjusted loan balance (Field 4008) in Form 4 Table 1 does not equal to amounts receivable from margin clients reported in balance sheet (Field 1012) in Form 1."]
[1298,"Form 4 is submitted but no data is reported.  "]
[1299,"Form 3 shows that the total amount drawn or utilized by the licensed corporation (Field 3001) may have exceeded the total credit facility limit (Field 3000) or total acceptable discounted value of security provided (Field 3003)."]
[1300,"Gearing adjustment (Field 1086) does not appear to be correctly calculated.  "]
[1301,"The aggregate amount of top margin loans provided in Form 4 Table 1 (Field 4000) accounted for less than 80% of the total unadjusted loans of the licensed corporation (Field 4008)."]
[1302,"Form 7 reports commission income from futures and options dealing but there is no turnover in futures and options contracts for client account."]
[1303,"Form 7 reports turnover in futures and options contracts for client account but there is no active futures and options clients reported in Form 12."]
[1304,"Form 7 shows an amount reported in turnover of securities (Field 7003) in the current month which is inconsistent with the regulated activities reported by the licensed corporation."]
[1305,"Form 7 shows an amount reported in securities dealing commission income or expense in the current month which is inconsistent with the regulated activities reported by the licensed corporation."]
[1306,"Form 7 and/or Form 8 report(s) turnover of securities for client account and/or client assets held by the licensed corporation, but no active securities client is reported in Form 12."]
[1307,"Form 7 reports an income arising from underwriting and placing of securities which is inconsistent with the regulated activities reported by the licensed corporation."]
[1308,"Form 7 reports securities dealing commission income but there is no turnover of securities for client account."]
[1309,"Retained profits/(accumulated losses) at the end of current month (Field 7144) does not equal to the year-to-date amount (Field 7146 or Field 1114)."]
[1310,"Form 7 shows Licensed Corporation declared dividend during the reporting month (Field 7141) but the aggregate of retained profits/accumulated losses (Field 1114) and other reserves (Field 1115) is negative.  "]
[1311,"Please specify the nature of other income in Field 7087A for the amount reported in Field 7087 in Form 7."]
[1312,"Please specify the nature of other trading profit and loss in Field 7063A for the amount reported in Field 7063 in Form 7."]
[1313,"Please specify the nature of other overheads in Field 7123A for the amount reported in Field 7123 in Form 7."]
[1314,"Form 7 shows amounts reported in Total gross principal value of contracts in leveraged foreign exchange trading (Field 7018A), commission income and/or commission expense arising from leveraged foreign exchange trading (Field 7039 and/or Field 7042), which are inconsistent with the regulated activity reported by the licensed corporation."]
[1315,"Form 7 reports an amount in turnover of securities dealing, or commission income or expense arising from securities dealing in the current month, which is inconsistent with the regulated activity reported by the licensed corporation."]
[1316,"Form 7 reports an amount in turnover of futures and options contracts, or commission income or expense arising from futures and options dealing in the current month, which is inconsistent with the regulated activity reported by the licensed corporation."]
[1317,"Form 7 reports an amount in securities dealing commission income and/or commission paid in the Current Month which is inconsistent with the regulated activity reported by the licensed corporation."]
[1318,"Form 7 reports an amount in futures and options trading commission income and/or commission paid in the Current Month which is inconsistent with the regulated activity reported by the licensed corporation."]
[1319,"Form 7 reports an amount in income arising from underwriting and placing of securities, advising on securities and/or futures contracts or corporate finance, or provision of automated trading services or asset management services in the current month, which is inconsistent with the regulated activity reported by the licensed corporation."]
[1320,"Form 8 Table 2 reports an amounts held in segregated bank account (Field 8114 + Field 8118) (amounted to ${1}K) which is different from the amount reported in Form 1 (Field 1008) (amounting to ${2}K).  "]
[1321,"Form 9 reports an amount in aggregate gross foreign currency position to be included in required liquid capital computation (Field {1}), which is different from that reported in Form 2 (Field {2})."]
[1322,"The licensed corporation reports to have {1} futures and options clients but it is not licensed for dealing in securities and futures contracts.  "]
[1323,"Form 12 reports to have active securities clients which is inconsistent with the regulated activities reported by the licensed corporation."]
[1324,"Form 12 reports to have {1} active cash clients which is inconsistent with the regulated activities reported by the licensed corporation."]
[1325,"Form 12 reports to have active clients in leveraged foreign exchange trading, which is inconsistent with the regulated activity reported by the licensed corporation."]
[1326,"Form 12 reports to have active cash clients which is inconsistent with the regulated activity reported by the licensed corporation."]
[1327,"Form 12 reports to have active futures and options (including stock options) clients which is inconsistent with the regulated activity reported by the licensed corporation."]
[1328,"Form 12 reports to have {1} active margin clients but it is not licensed for dealing in securities or securities margin financing.  "]
[1329,"Form 1 shows an amount reported in Item 14 Amounts receivable from other dealers and clearing participants etc. in respect of securities (Field 1027 and/or 1028) which is inconsistent with the regulated activities reported by the licensed corporation."]
[1330,"Form 12 reports to have active clients by service type and geographical location but no active clients by client type and vice versa."]
[1331,"Form 12 reports an aggregate of net value of AUM but no active clients by client type and to whom the licensed corporation provides asset management services is reported.  "]
[1332,"Form 12 reports an aggregate net value of AUM of ${1}K but it is not licensed for asset management.  "]
[1333,"Form 3 shows that for credit facilities secured by Type 6a \"Deposit provided by the licensed corporation\", the total relevant amount of \"market value of security provided\"  is greater than the amount of encumbered or pledged cash included in liquid assets as reported in Field 1107 in Form 1 Note 4. "]
[1334,"Reported loans and overdrafts from authorized financial institutions in Form 1 (Field 1076) do not equal to the loans and overdrafts from authorized financial institutions reported in Form 3 (i.e., Net of Field 3001 and the sum of fields in Column “Amount drawn or utilized by the licensed corporation” with corresponding fields in  “Code of financial institution” = 902 and 920). "]
[1335,"Reported loans and overdrafts from other financial institutions in Form 1 (Field 1078) do not equal to the aggregate of loans and overdrafts from other financial institutions reported in Form 3 (i.e., aggregate of fields in column “Amount drawn or utilised by the licensed corporation” with corresponding fields in “Code of financial institution” = 902 and 920)."]
[1336,"Collateral market value in row {1} of Form 4 Table 1 is smaller than the aggregate market value of the top 3 collaterals. Please check whether the collateral market value is reported correctly."]
[1337,"Form 7 shows that the total no. of futures and options contracts for own account (Field 7009) differs from that reported under Note 3 (Field AA205) by {1}."]
[1338,"Form 7 shows that the total no. of futures and options contracts in client account (Field 7012) differs from that reported under Note 3 (Field AA206 + Field AA207) by {1}."]
[1339,"It is noted that Field 7083 (year-to-date figure for income arising from asset management services) in Form 7 has data not equal to zero but zero or no data is reported under part B of Form 12 (AUM) or vice versa. Please check if Fields 7081 to 7083 of Form 7 and Field C110 of Form 12 part B are correctly reported. "]
[1340,"Please specify the nature of income arising from other management fees charged on group companies during the reporting month in Field 7146J for the amount reported in Field 7146I in Form 7."]
[1341,"Please specify the nature of other interest income in Field 7152A for the amount reported in Field 7152 in Form 7."]
[1342,"Please specify the nature of other interest expense paid or payable in Field 7156A for the amount reported in Field 7156 in Form 7."]
[1343,"Form 8 Table 1 shows the licensed corporation hold client securities of ${1}K but there is no active client under Form 12 Field C100A to C106."]
[1345,"Form 3 row {1} shows an acceptable discounted value of security provided of ${2}K which is greater than the market value of security provided of ${3}K."]
[1346,"Form 1 shows an amount reported in Note 7 Ranking liabilities relating to futures & unlisted options contracts for client account (Field 1112B) but there is no initial margin requirements or amounts of margin required to be deposited in respect of outstanding futures and unlisted options contracts held on behalf of clients reported in Form 2."]
[1347,"Form {1} is/are submitted, but it/they should not be required for the licensed corporation which is only licensed for advising on securities, futures contracts, corporate finance and/or asset management, and is subjected to specified licensing condition. Please check whether the submission is appropriate."]
[1348,"Form 1 Item 11 Proprietary positions in securities and specified investments (Field 1022) does not equal to the amount reported in Form 1 Note 6 (Field 1111E)."]
[1349,"[1009] need to be = [1110]"]
[1350,"Form 1 Item 28 Other payables and liabilities - accruals, amounts payable and other liabilities other than approved subordinated loan (Field 1082) does not equal to the sum of the secured and unsecured other payables and liabilities reported in Note 9 (Field AA112 + Field AA113)."]
[1351,"Form 1 Item 31 Ranking liabilities relating to futures & unlisted options contracts (Field 1088) does not equal to the sum of the ranking liabilities relating to futures & unlisted options contracts for house account (Field 1112A) and for client account (Field 1112B) reported in Form 1 Note 7."]
[1352,"Form 1 Note 4 shows that the sum of encumbered or pledged and unencumbered bank balances (Field 1107 + Field 1108) is less than the total amount of money the licensed corporation held in other accounts maintained with the top 5 authorized financial institutions or approved banks incorporated outside Hong Kong."]
[1353,"The aggregate market value of the investments reported in Form 1 Note 6(B) is greater than the sum of total market value of proprietary positions in securities and specified investments and proprietary positions in virtual assets reported in Form 1 Item 11 and 12a (Field 1022 + Field 1024B)."]
[1354,"Form 1 Note 7(a) shows that the sum of the Top 3 amounts receivable from group companies or other related parties is greater than the amounts receivable from group companies or other related parties reported in Form 1 Item 18 (Field 1049)."]
[1355,"Form 1 Note 7(b) shows that the sum of the secured and unsecured balances of the Top 3 amounts payable to group companies or other related parties is greater than the amounts payable to group companies or other related parties reported in Form 1 Item 28 (Field 1080)."]
[1356,"The amount of retained profits/(accumulated losses) for the current month reported in cell 7144 and cell 7146 for the amount reported in cell 1114 in Form 7."]
[1357,"[2012] need to be = [9000]"]
[1358,"Form 7 shows that the total turnover in securities dealing in own account (Field 7000) does not equal to that reported under Note 2 (Field AA200)."]
[1359,"Form 7 shows that the total turnover in securities dealing in client account (Field 7003) does not equal to that reported under Note 2 (Field AA201 + Field AA202)"]
[1360,"Form 7 shows that the total number of contracts for client account (Field 7012) differs from that reported under Note 3 (Field AA206 + Field AA207)."]
[1361,"Form 7 shows that the income arising from placing of securities (Field 7071A) does not equal to that reported under Note 8 (Field 7146F)."]
[1362,"Form 7 shows that the commission income arising from securities dealing (Field 7021) does not equal to that reported under Note 2 (Field AA203 + Field AA204)."]
[1363,"Form 8 Table 1 Note 3 shows that the aggregate market value of client securities held in top 3 locations in Hong Kong is greater than the total amount held in other locations or for other purposes in Hong Kong reported in Form 8 Table 1 (Field 8021A)."]
[1364,"Form 8 Table 1 Note 3 shows that the aggregate market value of client securities held in top 3 locations outside Hong Kong is greater than the amount held in other locations or for other purposes outside Hong Kong reported in Form 8 Table 1 (Field 8021F)."]
[1365,"Form 8 Table 2 Note 4 shows that the aggregate amount of client money held in segregated accounts maintained with top 5 authorized financial institutions and other persons approved by the Commission is greater than the total amounts reported in Field 8114 and Field 8116."]
[1366,"Form 8 Table 2 Note 5 shows that the aggregate amount of client money held in segregated accounts maintained with top 5 approved banks is greater than the amount reported in Field 8118."]
[1367,"Form 8 Table 2 Note 7 shows that the aggregate amount of client money held in segregated accounts maintained with Top 5 overseas locations other than approved banks incorporated outside Hong Kong (Field 8127 + Field 8128 + Field 8129 + Field 8130 + Field 8131) is greater than the amounts included in ranking liabilities per item 23 of liquid capital computation reported in Form 8 Table 2 (Field 8125)."]
[1368,"Form 8 Table 1b shows that aggregate market value of securities collateral of borrowing and non-borrowing margin clients (Field 8288 + Field 8289) is greater than the total amount of client securities held reported in Form 8 Table 1a (Field 8022)"]
[1369,"Form 8 Table 1b Note 3 shows that the aggregate market value of Top 3 other margin client securities collateral is greater than the total market value of other margin client securities collaterals reported in Form 8 Table 1b (Field 8284 + Field 8285)."]
[1370,"Please specify the nature of other management fees charged by group companies in Field 7160A for the amount reported in Field 7160 in Form 7."]
[1371,"Form 8 Table 1b shows that, for margin client securities collateral which belonged to borrowing margin clients, the total market value of {1} (Field {2}) is less than that re-pledged to authorised financial institutions or licensed securities dealers (Field {3})."]
[1372,"Form 8 Table 1b shows that, for margin client securities collateral which belonged to non-borrowing margin clients, the total market value of {1} (Field {2}) is less than that re-pledged to authorised financial institutions or licensed securities dealers (Field {3})."]
[1373,"Stock code/ sedol no./ ISIN code in Part (B) should not be already reported in Part (A)"]
[1374,"Form 1 shows an amount reported in Note 7 Ranking liabilities relating to futures and unlisted options contracts for house account (Field 1112A) but there is no proprietary position in futures and unlisted options contracts reported in Form 10 Table 1."]
[1375,"Form 10 Table 1 shows that the licensed corporation holds proprietary positions in futures and unlisted options contracts but there is no ranking liabilities relating to futures and unlisted options contracts for house account (Field 1112A) reported under Note 7 of Form 1."]
[1376,"Licensed Corporation declared to have submitted Form 10 for March, June, September or December, but nil information was inputted in Form 10."]
[1377,"Form 10 is submitted but no data is reported in Form 10 Table {1}. "]
[1378,"Form 1 shows an amount reported in Item 23 Amounts payable to clients (Field 1057 and/or 1058) which is inconsistent with the regulated activities reported by the licensed corporation."]
[1379,"Total value of margin client securities re-pledged in Note 6 <> Sum of \"Market value of securities provided\" (Col O) for bank lines with Type of securities provided being \"Margin client securities\" in Col L"]
[1380,"Disclosure of total loans drawn or utilized wholly or partly secured by margin client securities of ${1}K in Note 1(a) of Form 3 does not equal to the total of the column \"Amount drawn or utilized by the licensed corporation” where the column for type of security provided is \"8a\"."]
[1381,"Form 1 Item 31 Ranking liabilities relating to concentration of margin clients reported in Field 1089 of ${1}K is different from the amount of ${2}K derived from the information reported in Form 4 Table 2. "]
[1382,"[1015] need to be = [6010]"]
[1383,"[1016] need to be = [6008]"]
[1384,"Form 12 is submitted but no data is reported. "]
[1385,"[1111E] need to be = [1022]"]
[1386,"Form 7 shows that the income arising from management fees charged on group companies (Field 7084) does not equal to that reported under Note 5 (Field 7146K)."]
[1387,"Form 7 Note 7 reports the management fees charged by group companies (Field 7161) which does not equal to that reported in Form 7 (Field 7120)."]
[1388,"Form 7 shows that the commission income arising from futures and options dealing (Field 7030) does not equal to that reported under Note 3 (Field AA208 + Field AA209)."]
[1389,"Form 7 shows that the income arising from underwriting of securities (Field 7069) does not equal to that reported under Note 7 (Field 7146C)."]
[1391,"Form 7 Note 6 reports the amount of interest income (Field 7153) which does not equal to that reported in Form 7 (Field 7096)."]
[1392,"Form 7 Note 6 reports the amount of interest expense (Field 7157) which does not equal to that reported in Form 7 (Field 7099)."]
[1393,"Form 1 Note 4 shows that the amount held in other accounts maintained with the top 5 authorized financial institutions or approved banks incorporated outside Hong Kong in row {1} is greater than the sum of encumbered or pledged and unencumbered bank balances of the licensed corporation (Field 1107 + Field 1108). "]
[1394,"Form 1 Note 6(B) shows that the market value of the investment in row {1} is greater than the total market value of proprietary positions in securities and specified investments reported in Form 1 Item 11 (Field 1022 + Field 1024B)."]
[1395,"The amounts receivable in row {1} of Form 1 Note 7(a) is greater than the amounts receivable from group companies or other related parties reported in Form 1 Item 18 (Field 1049)."]
[1396,"The sum of the secured and unsecured balances in row {1} of Form 1 Note 7(b) is greater than the amounts payable to group companies or other related parties reported in Form 1 Item 28 (Field 1080)."]
[1397,"Please specify the stock name in row {1} in Form 5."]
[1398,"Form 12 reports to have active rolling balance cash clients which is inconsistent with the regulated activity reported by the licensed corporation."]
[1399,"Form 12 reports to have active leveraged foreign exchange trading clients which is inconsistent with the regulated activity reported by the licensed corporation."]
[1400,"Form 12 reports to have active clients to whom the licensed corporation provides services of advising on securities or futures contracts, advising on corporate finance or asset management, which is inconsistent with the regulated activity reported by the licensed corporation."]
[1401,"Form 1 shows an amount reported in Item 7 Amounts receivable from clients for subscription of securities (Field 1013 and/or 1014) which is inconsistent with the regulated activities reported by the licensed corporation."]
[1402,"Form 1 shows an amount reported in Item 8 Amounts receivable from rolling balance cash clients (Field 1015 and/or 1016) which is inconsistent with the regulated activities reported by the licensed corporation."]
[1403,"Form 1 shows an amount reported in Item 9 Other amounts receivable from clients arising from dealing in securities (Field 1017 and/or 1018) which is inconsistent with the regulated activities reported by the licensed corporation."]
[1404,"Form 1 Item 5 Bank balances held in segregated accounts - the amount included in liquid asset (Field 1007) is larger than the amount reported in balance sheet (Field 1008) by ${1}K."]
[1405,"Form 1 Item 18 Other assets arising from credit rating services - the amount included in liquid asset (Field 1049A) is larger than the amount reported in balance sheet (Field 1049B) by ${1}K."]
[1406,"Form 1 Item 18 Other assets arising from securities borrowing and lending agreements - the amount included in liquid asset (Field 1049C) is larger than the amount reported in balance sheet (Field 1049D) by ${1}K."]
[1407,"Form 1 Item 18 Other assets arising from repurchase transactions - the amount included in liquid asset (Field 1049E) is larger than the amount reported in balance sheet (Field 1049F) by ${1}K."]
[1408,"Form 1 Item 28 Amounts of consideration for securities sold in repurchase transactions (Field 1080C) is smaller than the amount reported in balance sheet (Field 1080D) by ${1}K."]
[1409,"Please specify name of securities collateral in row {1} in Form 5."]
[1410,"Please specify the nature of other management fees charged on group companies in Field 7146D for the amount reported in Field 7146C in Form 7."]
[1411,"Form 7 Note 5 reports the income arising from management fees charged on group companies (Field 7146E) which does not equal to that reported in Form 7 (Field 7084)."]
[1412,"Passed all form validations"]
[1413,"Form 1 shows an amount reported in Item 18 Other assets arising from provision of virtual asset services (Field 1049G and/or 1049H) which is inconsistent with the regulated activities reported by the licensed corporation."]
[1414,"Form 1 Item 18 Other assets arising from provision of virtual asset services - the amount included in liquid asset (Field 1049G) is larger than the amount reported in balance sheet (Field 1049H) by ${1}K."]
[1415,"Form 1 Item 16A \"Amounts receivable from virtual assets trading platforms - licensed providers for virtual asset services\" - the amount included in liquid asset (Field 1040A) is larger than the amount reported in balance sheet (Field 1040B) by ${1}K."]
[1416,"Form 1 Item 16A \"Amounts receivable from virtual assets trading platforms - overseas virtual asset trading platforms\" - the amount included in liquid asset (Field 1040C) is larger than the amount reported in balance sheet (Field 1040D) by ${1}K."]
[1417,"Form 1 Item 28 Amounts payable to licensed providers licensed under AMLO- the amount included in ranking liabilities (Field 1080AA) is smaller than the amount reported in balance sheet (Field 1080AB) by ${1}K."]
[1418,"Form 1 Item 28 Aamounts payable to virtual assets trading platforms other than licensed providers lincesed under AMLO   - the amount included in ranking liabilities (Field 1080AC) is smaller than the amount reported in balance sheet (Field 1080AD) by ${1}K."]
[1419,"Form 1 Item 28 Loans from other lenders - the amount included in ranking liabilities (Field 1080AE) is smaller than the amount reported in balance sheet (Field 1080AF) by ${1}K."]
[1420,"Form 7 shows an amount reported in turnover of virtual assets (Field 7020E) in the current month which is inconsistent with the regulated activities reported by the licensed corporation."]
[1421,"Form 7 shows an amount reported in virtual assets dealing commission income or expense in the current month which is inconsistent with the regulated activities reported by the licensed corporation."]
[1422,"Form 7 and/or Form 8 report(s) turnover of virtual assets for client account and/or client virtual assets held by the licensed corporation, but no active virtual assets client is reported in Form 12."]
[1423,"Form 7 reports virtual assets dealing commission income but there is no turnover of virtual assets for client account."]
[1424,"Form 8 Table 1 shows the licensed corporation hold client virtual assets of ${1}K but there is no active client under Form 12 Field C105D."]
[1425,"Form 8 Table 1 Note 5 shows that the aggregate market value of client virtual assets held in top 3 locations by associated entities / other licensed providers is greater than the amount held in other locations or for other purposes outside Hong Kong reported in Form 8 Table 1 (Field 8021BA)."]
[1426,"Please specify the location(s) of the client virtual assets and the purpose(s) of the disposition(s) in Form 8 Table 1 Note 5 for the client virtual assets reported in Field {1}. "]
[1427,"Please select on which basis the client virtual assets are accounted for in Note 1 of Form 8 Table 1."]
[1428,"Please specify the name of the associated entity(ies) by which the client virtual assets are held in Field {1} in Form 8 Table 1."]
[1429,"Form 12 reports to have active virtual asset clients which is inconsistent with the regulated activities reported by the licensed corporation."]
[1430,"Please enter the number of active virtual assets clients in Field C105D in Form 12."]
[1431,"Please enter the number of clients to whom the licensed corporation provides virtual asset services in Form 12."]

{"sheet":"Label Mapping","index":25,"n_rows":1382,"n_cols":3,"rows_kept":1382,"cut":false,"hidden":true,"merged":[]}
["Form 1 Table 1"]
["Field ID","Display Label ID","Item no."]
["LCC1001",1000]
["LCC0001",1001,"Item 1"]
["LCC0002",1002,"Item 1"]
["LCC0003",1003,"Item 2"]
["LCC0004",1004,"Item 3"]
["LCC0004A",1005,"Item 3"]
["LCC1002A","1006A","Item 4"]
["LCC1002B","1006B","Item 4"]
["LCC1002C","1006C","Item 4"]
["LCC1002D","1006D","Item 4"]
["LCC1002E","1006E","Item 4"]
["LCC1002F","1006F","Item 4"]
["LCC1002G","1006G","Item 4"]
["LCC1002H","1006H","Item 4"]
["LCC1002I","1006I","Item 4"]
["LCC1002J","1006J","Item 4"]
["LCC1002K","1006K","Item 4"]
["LCC1002L","1006L","Item 4"]
["LCC1002M","1006M","Item 4"]
["LCC1002N","1006N","Item 4"]
["LCC1002O","1006O","Item 4"]
["LCC1002O1","1006O1","Item 4"]
["LCC1002P","1006P","Item 4"]
["LCC1002P1","1006P1","Item 4"]
["LCC1002Q","1006Q","Item 4"]
["LCC1002R","1006R","Item 4"]
["LCC1002S","1006S","Item 4"]
["LCC1002T","1006T","Item 4"]
["LCC1002U","1006U","Item 4"]
["LCC1002V","1006V","Item 4"]
["LCC1002W","1006W","Item 4"]
["Form 1 Table 2"]
["Field ID","Display Label ID","Item no."]
["LCC1055",1007,"Item 5"]
["LCC1003",1009,"Item 5"]
["LCC1004",1010,"Item 5"]
["LCC1005",1008,"Item 5"]
["LCC0008",1011,"Item 6"]
["LCC0009",1012,"Item 6"]
["LCC0010",1013,"Item 7"]
["LCC0011",1014,"Item 7"]
["LCC1006",1015,"Item 8"]
["LCC1007",1016,"Item 8"]
["LCC0012",1017,"Item 9"]
["LCC0013",1018,"Item 9"]
["LCC0014",1019,"Item 10"]
["LCC0015",1020,"Item 10"]
["LCC0016",1021,"Item 11"]
["LCC0017",1022,"Item 11"]
["LCC0018",1023,"Item 12"]
["LCC0019",1024,"Item 12"]
["LCC0019A","1024A","Item 12a"]
["LCC0019B","1024B","Item 12a"]
["LCC0020",1025,"Item 13"]
["LCC0021",1026,"Item 13"]
["LCC0022",1027,"Item 14"]
["LCC0023",1028,"Item 14"]
["LCC0024",1029,"Item 15"]
["LCC0025",1030,"Item 15"]
["LCC0026",1031,"Item 16"]
["LCC0027",1032,"Item 16"]
["LCC0028",1033,"Item 16"]
["LCC0029",1034,"Item 16"]
["LCC0030",1035,"Item 16"]
["LCC0031",1036,"Item 16"]
["LCC0032",1037,"Item 16"]
["LCC0033",1038,"Item 16"]
["LCC1008",1039,"Item 16"]
["LCC1009",1040,"Item 16"]
["LCC1009A","1040A","Item 16a"]
["LCC1009B","1040B","Item 16a"]
["LCC1009C","1040C","Item 16a"]
["LCC1009D","1040D","Item 16a"]
["LCC1010",1041,"Item 17"]
["LCC1011",1042,"Item 17"]
["LCC1012",1043,"Item 18"]
["LCC1013",1044,"Item 18"]
["LCC1014",1045,"Item 18"]
["LCC1015",1046,"Item 18"]
["LCC1016",1047,"Item 18"]
["LCC1017",1048,"Item 18"]
["LCC1018",1049,"Item 18"]
["LCC1018A","1049A","Item 18"]
["LCC1018B","1049B","Item 18"]
["LCC1018C","1049C","Item 18"]
["LCC1018D","1049D","Item 18"]
["LCC1018E","1049E","Item 18"]
["LCC1018F","1049F","Item 18"]
["LCC1018G","1049G","Item 18"]
["LCC1018H","1049H","Item 18"]
["LCC1019",1050,"Item 18"]
["LCC1020",1051,"Item 18"]
["LCC0036",1052,"Item 19"]
["LCC0037",1053,"Item 20"]
["LCC0038",1054,"Item 21"]
["Form 1 Table 3"]
["Field ID","Display Label ID","Item no."]
["LCC0039",1055,"Item 22"]
["LCC0040",1056,"Item 22"]
["LCC0041",1057,"Item 23"]
["LCC0042",1058,"Item 23"]
["LCC0043",1059,"Item 24"]
["LCC0044",1060,"Item 24"]
["LCC0045",1061,"Item 25"]
["LCC0046",1062,"Item 25"]
["LCC0047",1063,"Item 25"]
["LCC0048",1064,"Item 25"]
["LCC0049",1065,"Item 25"]
["LCC0050",1066,"Item 25"]
["LCC1021",1067,"Item 25"]
["LCC1022",1068,"Item 25"]
["LCC0051",1069,"Item 25"]
["LCC0052",1070,"Item 25"]
["LCC0053",1071,"Item 26"]
["LCC0054",1072,"Item 26"]
["LCC0055",1073,"Item 27"]
["LCC0056",1074,"Item 27"]
["LCC1023",1075,"Item 28"]
["LCC1024",1076,"Item 28"]
["LCC1025",1077,"Item 28"]
["LCC1026",1078,"Item 28"]
["LCC1027",1079,"Item 28"]
["LCC1028",1080,"Item 28"]
["LCC1028AA","1080AA","Item 28"]
["LCC1028AB","1080AB","Item 28"]
["LCC1028AC","1080AC","Item 28"]
["LCC1028AD","1080AD","Item 28"]
["LCC1028AE","1080AE","Item 28"]
["LCC1028AF","1080AF","Item 28"]
["LCC1028A","1080A","Item 28"]
["LCC1028B","1080B","Item 28"]
["LCC1028C","1080C","Item 28"]
["LCC1028D","1080D","Item 28"]
["LCC1029",1081,"Item 28"]
["LCC1030",1082,"Item 28"]
["LCC0059",1083,"Item 29"]
["LCC0060",1084,"Item 29"]
["LCC0061",1085,"Item 30"]
["LCC1056",1086,"Item 31"]
["LCC0062",1087,"Item 31"]
["LCC0063",1088,"Item 31"]
["LCC0064",1089,"Item 31"]
["LCC0065",1090,"Item 31"]
["LCC0066",1091,"Item 31"]
["LCC0067",1092,"Item 31"]
["LCC0068",1093,"Item 31"]
["LCC0069",1094,"Item 31"]
["LCC1031",1095,"Item 31"]
["LCC0071",1096,"Item 31"]
["LCC1032",1097,"Item 31"]
["LCC1033",1098,"Item 31"]
["LCC0073",1099,"Item 31"]
["LCC0074",1100,"Item 32"]
["LCC0075",1101,"Item 33"]
["LCC0077",1102,"Item 34"]
["LCC0078",1103,"Item 35"]
["LCC0079",1104,"Item 36"]
["LCC0080",1105,"Item 37"]
["LCC0081",1106,"Item 38"]
["LCC0082",1107,"Note 4"]
["LCC0083",1108,"Note 4"]
["LCC0084",1109,"Note 4"]
["LCC0085",1110,"Note 4"]
["LCC0086","Note 4 col 4","Note 4"]
["LCC0086A","Note 4 col 1","Note 4"]
["LCC0086B","Note 4 col 2","Note 4"]
["LCC0086C","Note 4 col 3","Note 4"]
["LCC0086D","Note 4 col 0","Note 4"]
["LCC1034","Form 1 - Note 5","Note 5"]
["LCC0091","1111A","Note 6"]
["LCC0092","1111B","Note 6"]
["LCC0093","1111C","Note 6"]
["LCC0094","1111D","Note 6"]
["LCC0096","1111E","Note 6"]
["LCC0099","Form 1 Note 6(B)","Note 6"]
["LCC0099A","Note 6 Table col 1","Note 6"]
["LCC0099B","Note 6 Table col 2","Note 6"]
["LCC0099C","Note 6 Table col 3","Note 6"]
["LCC0099D","Note 6 Table col 0","Note 6"]
["LCC0102","Note 7a Table col 4","Note 7"]
["LCC0102A","Note 7a Table col 1","Note 7"]
["LCC0102B","Note 7a Table col 2","Note 7"]
["LCC0102C","Note 7a Table col 3","Note 7"]
["LCC0103","Note 7b Table col 1","Note 7"]
["LCC0104","Note 7b Table col 2","Note 7"]
["LCC0105","Note 7b Table col 3","Note 7"]
["LCC0106","Note 7b Table col 4","Note 7"]
["LCC0106A","Note 7b Table col 5","Note 7"]
["LCC0106B","Note 7b Table col 6","Note 7"]
["LCC0109","Note 8a col 1","Note 8"]
["LCC0110","Note 8a col 2","Note 8"]
["LCC0111","Note 8a col 3","Note 8"]
["LCC0112","Note 8a col 4","Note 8"]
["LCC0113","Note 8a col 5","Note 8"]
["LCC0114","Note 8a col 6","Note 8"]
["LCC0300","AA100","Note 8"]
["LCC0301","AA101","Note 8"]
["LCC0302","AA102","Note 8"]
["LCC0303","AA103","Note 8"]
["LCC0115","Note 8bi col 1","Note 8"]
["LCC0116","Note 8bi col 2","Note 8"]
["LCC0117","Note 8bi col 3","Note 8"]
["LCC0118","Note 8bi col 4","Note 8"]
["LCC0119","Note 8bi col 5","Note 8"]
["LCC0120","Note 8bi col 6","Note 8"]
["LCC0304","AA104","Note 8"]
["LCC0305","AA105","Note 8"]
["LCC0306","AA106","Note 8"]
["LCC0307","AA107","Note 8"]
["LCC0121A","Note 8bii col 1","Note 8"]
["LCC0122A","Note 8bii col 2","Note 8"]
["LCC0123A","Note 8bii col 3","Note 8"]
["LCC0124A","Note 8bii col 4","Note 8"]
["LCC0125A","Note 8bii col 5","Note 8"]
["LCC0126A","Note 8bii col 6","Note 8"]
["LCC0308","AA108","Note 8"]
["LCC0309","AA109","Note 8"]
["LCC0310","AA110","Note 8"]
["LCC0311","AA111","Note 8"]
["LCC0191","AA112","Note 9"]
["LCC0192","AA113","Note 9"]
["LCC0314","AA114","Note 9"]
["LCC0193","1112A","Note 10"]
["LCC0194","1112B","Note 10"]
["LCC0195A","Note 11a col 1","Note 11"]
["LCC0196A","Note 11a col 2","Note 11"]
["LCC0197A","Note 11a col 3","Note 11"]
["LCC0198A","Note 11a col 4","Note 11"]
["LCC0199A","Note 11a col 5","Note 11"]
["LCC0200A","Note 11a col 6","Note 11"]
["LCC0316","AA116","Note 11"]
["LCC0317","AA117","Note 11"]
["LCC0318","AA118","Note 11"]
["LCC0319","AA119","Note 11"]
["LCC0320","AA120","Note 11"]
["LCC0321","AA121","Note 11"]
["LCC0322","AA122","Note 11"]
["LCC0323","AA123","Note 11"]
["LCC0324","AA124","Note 11"]
["LCC0325","AA125","Note 11"]
["LCC0326","AA126","Note 11"]
[null,"AA126","Note 11"]
["LCC0201A","Note 11b col 1","Note 11"]
["LCC0202A","Note 11b col 2","Note 11"]
["LCC0203A","Note 11b col 3","Note 11"]
["LCC0204A","Note 11b col 4","Note 11"]
["LCC0205A","Note 11b col 5","Note 11"]
["LCC0206A","Note 11b col 6","Note 11"]
["LCC0207A","Note 11b col 7","Note 11"]
["LCC0327","AA127","Note 11"]
["LCC0328","AA128","Note 11"]
["LCC0329","AA129","Note 11"]
["LCC0330","AA130","Note 11"]
["LCC0331","AA131","Note 11"]
["LCC0332","AA132","Note 11"]
["LCC0333","AA133","Note 11"]
["LCC0334","AA134","Note 11"]
["LCC0335","AA135","Note 11"]
["LCC0336","AA136","Note 11"]
["LCC0337","AA137","Note 11"]
["LCC0338","AA138","Note 11"]
["LCC0339","AA139","Note 11"]
["LCC1037",1113,"Note 12"]
["LCC1038",1114,"Note 12"]
["LCC1042",1115,"Note 12"]
["LCC1043",1116,"Note 12"]
[]
["Form 1 Declaration"]
["Field ID","Display Label ID","Item no."]
["LCC1057",1117]
["LCC1044",1118]
["LCC1045",1119]
["LCC1046",1120]
["LCC1047",1121]
["LCC1048",1122]
["LCC1049",1123]
["LCC1050",1124]
["LCC1051",1125]
["LCC1052",1126]
["LCC1053",1127]
["LCC1054",1128]
["LCC0088",1130]
["LCC0089",1131]
["LCC0090",1132]
[]
["Form 2"]
["Field ID","Display Label ID","Item no."]
["RLC0001",2000,"(I)"]
["RLC0002",2001,"(II)"]
["RLC0003",2002,"(II)"]
["RLC0004",2003,"(II)"]
["RLC0005",2004,"(II)"]
["RLC0006",2005,"(II)"]
["RLC0007",2006,"(II)"]
["RLC0007A","2006A","(II)"]
["RLC0008",2007,"(II)"]
["RLC0009A","2008A","(II)"]
["RLC0009B","2008B","(II)"]
["RLC0010A","2008C","(II)"]
["RLC0010B","2008D","(II)"]
["RLC0010",2009,"(II)"]
["RLC0011",2010,"(II)"]
["RLC0012",2011,"(II)"]
["RLC0013",2012,"(III)"]
["RLC0014",2013,"(III)"]
[]
[]
[]
["Form 3"]
["Field ID","Display Label ID","Item no."]
["CFS1001","Credit facility group"]
["CFS0001","Code of financial institution"]
["CFS0002","Name of financial institution"]
["CFS1002","Credit facility code"]
["CFS0003","Nature"]
["CFS0004","Maturity"]
["CFS0005","Limit"]
["CFS1003","Amount drawn or utilized by the licensed corporation"]
["CFS0007","Security code"]
["CFS0007A","Security type"]
["CFS0008","Name of provider and its relationship with the licensed corporation"]
["CFS0009","Market value of security provided"]
["CFS0010","Acceptable discounted value of security provided"]
["CFS1004",3000]
["CFS1005",3001]
["CFS1006",3002]
["CFS1007",3003]
["CFS1009",3004]
["CFS1010",3005]
[]
["Form 4 Table 1"]
["Field ID","Display Label ID","Item no."]
["MCA0001","Name of client in Form 4 Table 1"]
["MCARANKING","Ranking in Form 4 Table 1"]
["MCA0002","(E12)"]
["MCA0003","Unadjusted loan balance in Form 4 Table 1"]
["MCA1001","Collateral market value in Form 4 Table 1"]
[null,"Adjusted loan balance in Form 4 Table 1"]
["MCA1010","(I12)"]
["MCA0004","Name of Collateral 1 in Form 4 Table 1"]
["MCA0005","Stock code/sedol no./ISIN code of Collateral 1 in Form 4 Table 1"]
["MCA0006","Market value of Collateral 1 in Form 4 Table 1"]
["MCA0007","Name of Collateral 2 in Form 4 Table 1"]
["MCA0008","Stock code/sedol no./ISIN code of Collateral 2 in Form 4 Table 1"]
["MCA0009","Market value of Collateral 2 in Form 4 Table 1"]
["MCA0010","Name of Collateral 3 in Form 4 Table 1"]
["MCA0011","Stock code/sedol no./ISIN code of Collateral 3 in Form 4 Table 1"]
["MCA0012","Market value of Collateral 3 in Form 4 Table 1"]
["MCA0014",4001]
["MCA1002",4002]
["MCA0015",4003]
["MCA0016",4004]
["MCA1003",4005]
["MCA1004",4006]
["MCA1006",4007]
["MCA0017",4008]
["MCA0018",4009]
["MCA1005",4010]
["MCA0019",4011]
["MCA0020",4012]
["MCA0026",4013]
["MCA1103",4000]
[]
[]
["Form 4 Table 2"]
["Field ID","Display Label ID","Item no."]
["MCA0021","Group number in Form 4 Table 2"]
["MCA0022","Name of client in Form 4 Table 2"]
["MCA0023","Adjusted loan balance in Form 4 Table 2"]
["MCA0111",4100]
["MCA0112",4101]
[]
["Form 4 Table 3"]
["Field ID","Display Label ID","Item no."]
["MCA0021","(C10)"]
["MCA0022","(D10)"]
["MCA0023","(E10)"]
["MCA0024",4102]
["MCA0025",4103]
[]
["Form 5"]
["Field ID","Display Label ID","Item no."]
["ASC1001","Name of shares or warrants in Form 5","(A)"]
["ASC1002","Stock code/sedol number in Form 5","(A)"]
["ASC1003","Market value in Form 5","(A)"]
["ASC1004","Market value of the securities collateral to the securities' average monthly turnover ","(A)"]
["ASC1005","Market value of the securities collateral to the securities' market capitalization (%)","(A)"]
["ASC0001",5003]
[]
["Form 6"]
["Field ID","Display Label ID","Item no."]
["RBCRANKING","(C11)"]
["RBC0001","Name of client in Form 6"]
["RBC0002","Account balance in Form 6"]
["RBC0003","Market value of securities holdings in Form 6"]
["RBC0004","Adjusted balance in Form 6"]
["RBC0005",6000]
["RBC0006",6001]
["RBC0007",6002]
["RBC0008",6003]
["RBC0009",6004]
["RBC0010",6005]
["RBC0011",6006]
["RBC1001",6007]
["RBC0012",6008]
["RBC0013",6009]
["RBC0014",6010]
["RBC0015","Ratio of account balance to market value of securities holdings in Form 6"]
["RBC0016","Security 1 - Name in Form 6"]
["RBC0017","Security 1 - Stock code/sedol number/ISIN code in Form 6"]
["RBC0018","Security 1 - Market value in Form 6"]
["RBC0019","Security 2 - Name in Form 6"]
["RBC0020","Security 2 - Stock code/sedol number/ISIN code in Form 6"]
["RBC0021","Security 2 - Market value in Form 6"]
["RBC0022","Security 3 - Name in Form 6"]
["RBC0023","Security 3 - Stock code/sedol number/ISIN code in Form 6"]
["RBC0024","Security 3 - Market value in Form 6"]
[]
["Form 7"]
["Field ID","Display Label ID","Item no."]
["PLA0001",7000]
["PLA0002",7001]
["PLA0003",7002]
["PLA0004",7003]
["PLA0005",7004]
["PLA0006",7005]
["PLA0007",7006]
["PLA0008",7007]
["PLA0009",7008]
["PLA0010",7009]
["PLA0011",7010]
["PLA0012",7011]
["PLA0013",7012]
["PLA0014",7013]
["PLA0015",7014]
["PLA0016",7015]
["PLA0017",7016]
["PLA0018",7017]
["PLA1001","7018A"]
["PLA1002","7019A"]
["PLA1003","7020A"]
["PLA1003B","7020B"]
["PLA1003C","7020C"]
["PLA1003D","7020D"]
["PLA1003E","7020E"]
["PLA1003F","7020F"]
["PLA1003G","7020G"]
["PLA1003H","7020H"]
["PLA1003I","7020I"]
["PLA1003J","7020J"]
["PLA0019",7021]
["PLA0020",7022]
["PLA0021",7023]
["PLA0022",7024]
["PLA0023",7025]
["PLA0024",7026]
["PLA0025",7027]
["PLA0026",7028]
["PLA0027",7029]
["PLA0028",7030]
["PLA0029",7031]
["PLA0030",7032]
["PLA0031",7033]
["PLA0032",7034]
["PLA0033",7035]
["PLA0034",7036]
["PLA0035",7037]
["PLA0036",7038]
["PLA1004",7039]
["PLA1005",7040]
["PLA1006",7041]
["PLA1007",7042]
["PLA1008",7043]
["PLA1009",7044]
["PLA1010",7045]
["PLA1011",7046]
["PLA1012",7047]
["PLA1012A","7047A"]
["PLA1012B","7047B"]
["PLA1012C","7047C"]
["PLA1012D","7047D"]
["PLA1012E","7047E"]
["PLA1012F","7047F"]
["PLA1012G","7047G"]
["PLA1012H","7047H"]
["PLA1012I","7047I"]
["PLA0037",7048]
["PLA0038",7049]
["PLA0039",7050]
["PLA0040",7051]
["PLA0041",7052]
["PLA0042",7053]
["PLA1013",7054]
["PLA1014",7055]
["PLA1015",7056]
["PLA1016",7057]
["PLA1017",7058]
["PLA1018",7059]
["PLA0046",7060]
["PLA0047",7061]
["PLA0048",7062]
["PLA0048A","7062A"]
["PLA0048B","7062B"]
["PLA0048C","7062C"]
["PLA0049",7063]
["PLA0050",7064]
["PLA0051",7065]
["PLA0051A","7063A"]
["PLA1019",7066]
["PLA1020",7067]
["PLA1021",7068]
["PLA1098",7069]
["PLA1099",7070]
["PLA1100",7071]
["PLA1098A","7071A"]
["PLA1098B","7071B"]
["PLA1098C","7071C"]
["PLA1022",7072]
["PLA1023",7073]
["PLA1024",7074]
["PLA1025",7075]
["PLA1026",7076]
["PLA1027",7077]
["PLA1028",7078]
["PLA1029",7079]
["PLA1030",7080]
["PLA1031",7081]
["PLA1032",7082]
["PLA1033",7083]
["PLA1034",7084]
["PLA1035",7085]
["PLA1036",7086]
["PLA1036A","7086A"]
["PLA1036B","7086B"]
["PLA1036C","7086C"]
["PLA1036D","7086D"]
["PLA1036E","7086E"]
["PLA1036F","7086F"]
["PLA1037",7087]
["PLA1038",7088]
["PLA1039",7089]
["PLA1040","7087A"]
["PLA1041",7090]
["PLA1042",7091]
["PLA1043",7092]
["PLA1044",7093]
["PLA1045",7094]
["PLA1046",7095]
["PLA1066",7096]
["PLA1067",7097]
["PLA1068",7098]
["PLA1079",7099]
["PLA1080",7100]
["PLA1081",7101]
["PLA1082",7102]
["PLA1083",7103]
["PLA1084",7104]
["PLA0079",7105]
["PLA0080",7106]
["PLA0081",7107]
["PLA0082",7108]
["PLA0083",7109]
["PLA0084",7110]
["PLA0085",7111]
["PLA0086",7112]
["PLA0087",7113]
["PLA0088",7114]
["PLA0089",7115]
["PLA0090",7116]
["PLA0091",7117]
["PLA0092",7118]
["PLA0093",7119]
["PLA1085",7120]
["PLA1086",7121]
["PLA1087",7122]
["PLA1087A","7122A"]
["PLA1087B","7122B"]
["PLA1087C","7122C"]
["PLA1088",7123]
["PLA1089",7124]
["PLA1090",7125]
["PLA1091","7123A"]
["PLA1092",7126]
["PLA1093",7127]
["PLA1094",7128]
["PLA1095",7129]
["PLA1096",7130]
["PLA1097",7131]
["PLA1101",7132]
["PLA1102",7133]
["PLA1103",7134]
["PLA1104",7135]
["PLA1105",7136]
["PLA1106",7137]
["PLA1107",7138]
["PLA1108",7139]
["PLA1109",7140]
["PLA1110",7141]
["PLA1111",7142]
["PLA1112",7143]
["PLA1113",7144]
["PLA1114",7145]
["PLA1115",7146]
["PLA1300","AA200"]
["PLA1301","AA201"]
["PLA1302","AA202"]
["PLA1303","AA203"]
["PLA1304","AA204"]
["PLA1305","AA205"]
["PLA1306","AA206"]
["PLA1307","AA207"]
["PLA1308","AA208"]
["PLA1309","AA209"]
["PLA1316","7146A"]
["PLA1317","7146B"]
["PLA1318","7146C"]
["PLA1320","7146D"]
["PLA1319","7146E"]
["PLA1047",7147]
["PLA1050",7148]
["PLA1053",7149]
["PLA1053A","7149A"]
["PLA1056",7150]
["PLA1056A","7151A"]
["PLA1056B","7151B"]
["PLA1059",7151]
["PLA1062",7152]
["PLA1065","7152A"]
["PLA1116",7153]
["PLA1116A","7155A"]
["PLA1069",7154]
["PLA1072",7155]
["PLA1072A","7155A"]
["PLA1075",7156]
["PLA1078","7156A"]
["PLA1117",7157]
["PLA1200",7158]
["PLA1201",7159]
["PLA1202",7160]
["PLA1204","7160A"]
["PLA1203",7161]
["PLA1300A","Form 7 Note 2 col 1 row 1"]
["PLA1300B","Form 7 Note 2 col 1 row 2"]
["PLA1300C","Form 7 Note 2 col 1 row 3"]
["PLA1300D","Form 7 Note 2 col 1 row 4"]
["PLA1300E","Form 7 Note 2 col 1 row 5"]
["PLA1301A","Form 7 Note 2 col 2 row 1"]
["PLA1301B","Form 7 Note 2 col 2 row 2"]
["PLA1301C","Form 7 Note 2 col 2 row 3"]
["PLA1301D","Form 7 Note 2 col 2 row 4"]
["PLA1301E","Form 7 Note 2 col 2 row 5"]
["PLA1302A","Form 7 Note 2 col 3 row 1"]
["PLA1302B","Form 7 Note 2 col 3 row 2"]
["PLA1302C","Form 7 Note 2 col 3 row 3"]
["PLA1302D","Form 7 Note 2 col 3 row 4"]
["PLA1302E","Form 7 Note 2 col 3 row 5"]
["PLA1303A","Form 7 Note 2 col 4 row 1"]
["PLA1303B","Form 7 Note 2 col 4 row 2"]
["PLA1303C","Form 7 Note 2 col 4 row 3"]
["PLA1303D","Form 7 Note 2 col 4 row 4"]
["PLA1303E","Form 7 Note 2 col 4 row 5"]
["PLA1304A","Form 7 Note 2 col 5 row 1"]
["PLA1304B","Form 7 Note 2 col 5 row 2"]
["PLA1304C","Form 7 Note 2 col 5 row 3"]
["PLA1304D","Form 7 Note 2 col 5 row 4"]
["PLA1304E","Form 7 Note 2 col 5 row 5"]
["PLA1305A","Form 7 Note 2 col 1 row 6"]
["PLA1305B","Form 7 Note 2 col 1 row 7"]
["PLA1305C","Form 7 Note 2 col 1 row 8"]
["PLA1305D","Form 7 Note 2 col 1 row 9"]
["PLA1306A","Form 7 Note 2 col 2 row 6"]
["PLA1306B","Form 7 Note 2 col 2 row 7"]
["PLA1306C","Form 7 Note 2 col 2 row 8"]
["PLA1306D","Form 7 Note 2 col 2 row 9"]
["PLA1307A","Form 7 Note 2 col 3 row 6"]
["PLA1307B","Form 7 Note 2 col 3 row 7"]
["PLA1307C","Form 7 Note 2 col 3 row 8"]
["PLA1307D","Form 7 Note 2 col 3 row 9"]
["PLA1308A","Form 7 Note 2 col 4 row 6"]
["PLA1308B","Form 7 Note 2 col 4 row 7"]
["PLA1308C","Form 7 Note 2 col 4 row 8"]
["PLA1308D","Form 7 Note 2 col 4 row 9"]
["PLA1309A","Form 7 Note 2 col 5 row 6"]
["PLA1309B","Form 7 Note 2 col 5 row 7"]
["PLA1309C","Form 7 Note 2 col 5 row 8"]
["PLA1309D","Form 7 Note 2 col 5 row 9"]
[]
[]
["Form 8 Table 1a"]
["Field ID","Display Label ID","Item no."]
["ACA0001",8000]
["ACA0002",8001]
["ACA0003",8002]
["ACA1001",8003]
["ACA1002","8004A"]
["ACA1072","8004B"]
["ACA1003","8005A"]
["ACA0004","8005B"]
["ACA1005","8005C"]
["ACA0005",8006]
["ACA0005A","8006A"]
["ACA1006","8007A"]
["ACA1007","8008A"]
["ACA0010",8018]
["ACA1013",8009]
["ACA1009",8010]
["ACA1008","8010A"]
["ACA1011",8011]
["ACA1010","8011A"]
["ACA1012",8012]
["ACA1014",8013]
["ACA1042","8013A"]
["ACA1043","8013C"]
["ACA1044","8013E"]
["ACA1045","8013G"]
["ACA1046","8013B"]
["ACA1047","8013D"]
["ACA1048","8013F"]
["ACA1049","8013H"]
["ACA1050",8014]
["ACA1075",8015]
["ACA1016",8017]
["ACA1015","8017A"]
["ACA0007",8015]
["ACA0008",8016]
["ACA1016",8017]
["ACA1017",8019]
["ACA1018",8020]
["ACA0013","8021A"]
["ACA1019","8021B"]
["ACA1019BA","8021BA"]
["ACA1019BB","8021BB"]
["ACA0016","Form 8 Table 1 - Note 1"]
["ACA0013A",8025]
["ACA1051","8007B"]
["ACA1052","8021C"]
["ACA1054","8021E"]
["ACA1055","8021F"]
["ACA1056","8021G"]
["ACA1057",8022]
["ACA1058",8026]
["ACA1059",8027]
["ACA1060",8028]
["ACA1061",8029]
["ACA1062",8030]
["ACA1063",8031]
["ACA1064",8032]
["ACA1085",8033]
["ACA1066",8034]
["ACA1068",8035]
["ACA1069",8036]
["ACA1070",8037]
["ACA1071",8038]
["ACA1073",8039]
["ACA1074",8040]
["ACA1086",8008]
[]
["ACA1058A","Form 8 Table 1 a - Note 2 - HK Col 1 - Ranking 1"]
["ACA1058B","Form 8 Table 1 a - Note 2 - HK Col 2 - Ranking 1"]
["ACA1059A","Form 8 Table 1 a - Note 2 - HK Col 1 - Ranking 2"]
["ACA1059B","Form 8 Table 1 a - Note 2 - HK Col 2 - Ranking 2"]
["ACA1060A","Form 8 Table 1 a - Note 2 - HK Col 1 - Ranking 3"]
["ACA1060B","Form 8 Table 1 a - Note 2 - HK Col 2 - Ranking 3"]
["ACA1061A","Form 8 Table 1 a - Note 2 - Outside HK Col 1 - Ranking 1"]
["ACA1061B","Form 8 Table 1 a - Note 2 - Outside HK Col 2 - Ranking 1"]
["ACA1061C","Form 8 Table 1 a - Note 2 - Outside HK Col 3 - Ranking 1"]
["ACA1062A","Form 8 Table 1 a - Note 2 - Outside HK Col 1 - Ranking 2"]
["ACA1062B","Form 8 Table 1 a - Note 2 - Outside HK Col 2 - Ranking 2"]
["ACA1062C","Form 8 Table 1 a - Note 2 - Outside HK Col 3 - Ranking 2"]
["ACA1063A","Form 8 Table 1 a - Note 2 - Outside HK Col 1 - Ranking 3"]
["ACA1063B","Form 8 Table 1 a - Note 2 - Outside HK Col 2 - Ranking 3"]
["ACA1063C","Form 8 Table 1 a - Note 2 - Outside HK Col 3 - Ranking 3"]
["ACA1064A","Form 8 Table 1 a - Note 3 - HK Col 1 - Ranking 1"]
["ACA1064B","Form 8 Table 1 a - Note 3 - HK Col 2 - Ranking 1"]
["ACA1085A","Form 8 Table 1 a - Note 3 - HK Col 1 - Ranking 2"]
["ACA1085B","Form 8 Table 1 a - Note 3 - HK Col 2 - Ranking 2"]
["ACA1066A","Form 8 Table 1 a - Note 3 - HK Col 1 - Ranking 3"]
["ACA1066B","Form 8 Table 1 a - Note 3 - HK Col 2 - Ranking 3"]
["ACA1068A","Form 8 Table 1 a - Note 3 - Outside HK Col 1 - Ranking 1"]
["ACA1068B","Form 8 Table 1 a - Note 3 - Outside HK Col 2 - Ranking 1"]
["ACA1068C","Form 8 Table 1 a - Note 3 - Outside HK Col 3 - Ranking 1"]
["ACA1069A","Form 8 Table 1 a - Note 3 - Outside HK Col 1 - Ranking 2"]
["ACA1069B","Form 8 Table 1 a - Note 3 - Outside HK Col 2 - Ranking 2"]
["ACA1069C","Form 8 Table 1 a - Note 3 - Outside HK Col 3 - Ranking 2"]
["ACA1070A","Form 8 Table 1 a - Note 3 - Outside HK Col 1 - Ranking 3"]
["ACA1070B","Form 8 Table 1 a - Note 3 - Outside HK Col 2 - Ranking 3"]
["ACA1070C","Form 8 Table 1 a - Note 3 - Outside HK Col 3 - Ranking 3"]
["ACA1071A","Form 8 Table 1 a - Note 5 Col 1 - Ranking 1"]
["ACA1071B","Form 8 Table 1 a - Note 5 Col 2 - Ranking 1"]
["ACA1071C","Form 8 Table 1 a - Note 5 Col 3 - Ranking 1"]
["ACA1073A","Form 8 Table 1 a - Note 5 Col 1 - Ranking 2"]
["ACA1073B","Form 8 Table 1 a - Note 5 Col 2 - Ranking 2"]
["ACA1073C","Form 8 Table 1 a - Note 5 Col 3 - Ranking 2"]
["ACA1074A","Form 8 Table 1 a - Note 5 Col 1 - Ranking 3"]
["ACA1074B","Form 8 Table 1 a - Note 5 Col 2 - Ranking 3"]
["ACA1074C","Form 8 Table 1 a - Note 5 Col 3 - Ranking 3"]
[]
[]
["Form 8 Table 1b"]
["Field ID","Display Label ID"]
["ACA2000","column of Market value of margin client securities collateral which belonged to borrowing margin clients","Item no."]
["ACA2001","column of Market value of margin client securities collateral which belonged to non-borrowing margin clients"]
["ACA2002","column of Market value of margin client securities collateral re-pledged to authorized financial institutions or licensed securities dealers (for RA8 licensees only) which belonged to borrowing margin clients"]
["ACA2003","column of Market value of margin client securities collateral re-pledged to authorized financial institutions or licensed securities dealers (for RA8 licensees only) which belonged to non-borrowing margin clients"]
["ACA2100",8270]
["ACA2005"," sum of \"Others\" (i.e., item (V)) reported under Market value of margin client securities collateral which belonged to non-borrowing margin client"]
["ACA2000",8200]
["ACA2001",8201]
["ACA2002",8202]
["ACA2003",8203]
["ACA2004",8288]
["ACA2005",8289]
["ACA2006",8290]
["ACA2007",8291]
["ACA2008","(I56)"]
["F8T1B_NAME_0","listed stocks which are constituent of Hang Seng Index"]
["F8T1B_NAME_1","listed stocks which are constituent of Hang Seng Composite LargeCap Index"]
["F8T1B_NAME_2","other stocks listed on the Main Board"]
["F8T1B_NAME_3","other stocks listed on the GEM Board"]
["F8T1B_NAME_4","stocks listed in the Mainland China"]
["F8T1B_NAME_5","stocks listed overseas"]
["F8T1B_NAME_9","investment grade corporate bonds"]
["F8T1B_NAME_10","non-investment grade corporate bonds"]
["F8T1B_NAME_11","unrated grade corporate bonds"]
["F8T1B_NAME_13","investment grade sovereign bonds/ bonds issued by public sector entity/ multilateral development banks"]
["F8T1B_NAME_14","non-investment grade sovereign bonds/ bonds issued by public sector entity/ multilateral development banks"]
["F8T1B_NAME_15","unrated sovereign bonds/ bonds issued by public sector entity/ multilateral development banks"]
["F8T1B_NAME_16","other debt securities"]
["F8T1B_NAME_20","SFC-authorized collective investment schemes"]
["F8T1B_NAME_21","SFC-authorized hedge funds"]
["F8T1B_NAME_22","SFC-authorized private equity funds"]
["F8T1B_NAME_23","other SFC-authorized funds"]
["F8T1B_NAME_25","unauthorised collective investment schemes"]
["F8T1B_NAME_26","unauthorised hedge funds"]
["F8T1B_NAME_27","unauthorised private equity funds"]
["F8T1B_NAME_28","other unauthorised funds"]
["F8T1B_NAME_30","other securities"]
["F8T1B_COL1_0",8200]
["F8T1B_COL1_1",8204]
["F8T1B_COL1_2",8208]
["F8T1B_COL1_3",8212]
["F8T1B_COL1_4",8216]
["F8T1B_COL1_5",8220]
["F8T1B_COL1_9",8224]
["F8T1B_COL1_10",8228]
["F8T1B_COL1_11",8232]
["F8T1B_COL1_13",8236]
["F8T1B_COL1_14",8240]
["F8T1B_COL1_15",8244]
["F8T1B_COL1_16",8248]
["F8T1B_COL1_20",8252]
["F8T1B_COL1_21",8256]
["F8T1B_COL1_22",8260]
["F8T1B_COL1_23",8264]
["F8T1B_COL1_25",8268]
["F8T1B_COL1_26",8272]
["F8T1B_COL1_27",8276]
["F8T1B_COL1_28",8280]
["F8T1B_COL1_30",8284]
["F8T1B_COL2_0",8201]
["F8T1B_COL2_1",8205]
["F8T1B_COL2_2",8209]
["F8T1B_COL2_3",8213]
["F8T1B_COL2_4",8217]
["F8T1B_COL2_5",8221]
["F8T1B_COL2_9",8225]
["F8T1B_COL2_10",8229]
["F8T1B_COL2_11",8233]
["F8T1B_COL2_13",8237]
["F8T1B_COL2_14",8241]
["F8T1B_COL2_15",8245]
["F8T1B_COL2_16",8249]
["F8T1B_COL2_20",8253]
["F8T1B_COL2_21",8257]
["F8T1B_COL2_22",8261]
["F8T1B_COL2_23",8265]
["F8T1B_COL2_25",8269]
["F8T1B_COL2_26",8273]
["F8T1B_COL2_27",8277]
["F8T1B_COL2_28",8281]
["F8T1B_COL2_30",8285]
["F8T1B_COL3_0",8202]
["F8T1B_COL3_1",8206]
["F8T1B_COL3_2",8210]
["F8T1B_COL3_3",8214]
["F8T1B_COL3_4",8218]
["F8T1B_COL3_5",8222]
["F8T1B_COL3_9",8226]
["F8T1B_COL3_10",8230]
["F8T1B_COL3_11",8234]
["F8T1B_COL3_13",8238]
["F8T1B_COL3_14",8242]
["F8T1B_COL3_15",8246]
["F8T1B_COL3_16",8250]
["F8T1B_COL3_20",8254]
["F8T1B_COL3_21",8258]
["F8T1B_COL3_22",8262]
["F8T1B_COL3_23",8266]
["F8T1B_COL3_25",8270]
["F8T1B_COL3_26",8274]
["F8T1B_COL3_27",8278]
["F8T1B_COL3_28",8282]
["F8T1B_COL3_30",8286]
["F8T1B_COL4_0",8203]
["F8T1B_COL4_1",8207]
["F8T1B_COL4_2",8211]
["F8T1B_COL4_3",8215]
["F8T1B_COL4_4",8219]
["F8T1B_COL4_5",8223]
["F8T1B_COL4_9",8227]
["F8T1B_COL4_10",8231]
["F8T1B_COL4_11",8235]
["F8T1B_COL4_13",8239]
["F8T1B_COL4_14",8243]
["F8T1B_COL4_15",8247]
["F8T1B_COL4_16",8251]
["F8T1B_COL4_20",8255]
["F8T1B_COL4_21",8259]
["F8T1B_COL4_22",8263]
["F8T1B_COL4_23",8267]
["F8T1B_COL4_25",8271]
["F8T1B_COL4_26",8275]
["F8T1B_COL4_27",8279]
["F8T1B_COL4_28",8283]
["F8T1B_COL4_30",8287]
[]
["Form 8 Table 2"]
["Field ID","Display Label ID"]
["ACA0017",8100,"Item no."]
["ACA0018",8102]
["ACA0019",8104]
["ACA1020",8106]
["ACA1051",8108]
["ACA1021","8110A"]
["ACA1022",8110]
["ACA1023",8112]
["ACA1024",8114]
["ACA1053",8116]
["ACA1025",8118]
["ACA1026",8119]
["ACA1027","8120A"]
["ACA1028",8120]
["ACA1029",8122]
["ACA1030",8125]
["ACA1031",8101]
["ACA1032",8103]
["ACA1033",8105]
["ACA1034",8107]
["ACA1052",8109]
["ACA1035",8111]
["ACA1036",8113]
["ACA1037",8115]
["ACA1038",8117]
["ACA1039",8121]
["ACA1040",8123]
["ACA1041",8124]
["ACA1300","8125A"]
["ACA1300A","Form 8 Table 2 Note 4 Name of the authorized financial institution"]
["ACA1300B","Form 8 Table 2 Note 4 Affiliate of the licensed corporation?"]
["ACA1065","8125F"]
["ACA1065A","Form 8 Table 2 Note 5 Name of the approved bank"]
["ACA1065B","Form 8 Table 2 Note 5 Geographical location of the approved bank"]
["ACA1065C","Form 8 Table 2 Note 5 Affiliate of the licensed corporation?"]
["ACA0027A",8126]
["ACA1075",8127]
["ACA1075A","Form 8 Table 2 Note 7 Name of counterparty"]
["ACA1075B","Form 8 Table 2 Note 7 Type of counterparty"]
["ACA1075C","Form 8 Table 2 Note 7 Geographical location "]
["ACA1075D","Form 8 Table 2 Note 7 Affiliate of the licensed corporation?"]
[]
["Form 9"]
["Field ID","Display Label ID"]
["FCP0001","Currency Code","Item no."]
["FCP0002","Currency Type"]
["FCP0003","Assets in Form 9"]
["FCP0004","Liabilities in Form 9"]
["FCP0005","Long commitments in Form 9"]
["FCP0006","Short commitments in Form 9"]
["FCP0007","Gross foreign currency position in Form 9"]
["FCP0008","Net position in Form 9"]
["FCP0009","Assets & long commitments in Form 9"]
["FCP0010","Liabilities & short commitments in Form 9"]
["FCP0011","Aggregate gross foreign currency position in Form 9"]
["FCP0012","AA300 Total of Assets in Form 9"]
["FCP0013","Total of Liabilities in Form 9"]
["FCP0014","Total of Long commitments in Form 9"]
["FCP0015","Total of Short commitments in Form 9"]
["FCP0016","Total of Gross foreign currency position in Form 9"]
["FCP0017","Total of Net position in Form 9"]
["FCP0018","Total of Assets & long commitments in Form 9"]
["FCP0019","Total of Liabilities & short commitments in Form 9"]
["FCP0020","AA308 Total of Aggregate gross foreign currency position in Form 9"]
["FCP0023",9000]
[]
["Form 10 Table 1"]
["Field ID","Display Label ID"]
["PDP0001","Equity contracts, Row 1","Item no."]
["PDP0002","Interest rate contracts, Row 1"]
["PDP0003","Foreign exchange contracts, Row 1"]
["PDP0004","Precious metals contracts, Row 1"]
["PDP0005","Other commodity contracts, Row 1"]
["PDP0005A","Virtual assets contracts, Row 1"]
["PDP0006"]
["PDP1001","Total, Row 1"]
["PDP0007","Equity contracts, Row 2"]
["PDP0008","Interest rate contracts, Row 2"]
["PDP0009","Foreign exchange contracts, Row 2"]
["PDP0010","Precious metals contracts, Row 2"]
["PDP0011","Other commodity contracts, Row 2"]
["PDP0011A","Virtual assets contracts, Row 2"]
["PDP0012"]
["PDP1002","Total, Row 2"]
["PDP0013","Equity contracts, Row 3"]
["PDP0014","Interest rate contracts, Row 3"]
["PDP0015","Foreign exchange contracts, Row 3"]
["PDP0016","Precious metals contracts, Row 3"]
["PDP0017","Other commodity contracts, Row 3"]
["PDP0017A","Virtual assets contracts, Row 3"]
["PDP0018"]
["PDP1003","Total, Row 3"]
["PDP0019","Equity contracts, Row 4"]
["PDP0020","Interest rate contracts, Row 4"]
["PDP0021","Foreign exchange contracts, Row 4"]
["PDP0022","Precious metals contracts, Row 4"]
["PDP0023","Other commodity contracts, Row 4"]
["PDP0023A","Virtual assets contracts, Row 4"]
["PDP0024"]
["PDP1004","Total, Row 4"]
["PDP0025","Equity contracts, Row 5"]
["PDP0026","Interest rate contracts, Row 5"]
["PDP0027","Foreign exchange contracts, Row 5"]
["PDP0028","Precious metals contracts, Row 5"]
["PDP0029","Other commodity contracts, Row 5"]
["PDP0029A","Virtual assets contracts, Row 5"]
["PDP0030"]
["PDP1005","Total, Row 5"]
["PDP0030A","A100"]
["PDP1006","Equity contracts, Row 6"]
["PDP1007","Interest rate contracts, Row 6"]
["PDP1008","Foreign exchange contracts, Row 6"]
["PDP1009","Precious metals contracts, Row 6"]
["PDP1010","Other commodity contracts, Row 6"]
["PDP1010A","Virtual assets contracts, Row 6"]
["PDP1011","Total, Row 6"]
["PDP0037","Equity contracts, Row 7"]
["PDP0038","Interest rate contracts, Row 7"]
["PDP0039","Foreign exchange contracts, Row 7"]
["PDP0040","Precious metals contracts, Row 7"]
["PDP0041","Other commodity contracts, Row 7"]
["PDP0041A","Virtual assets contracts, Row 7"]
["PDP0042"]
["PDP1012","Total, Row 7"]
["PDP0043","Equity contracts, Row 8"]
["PDP0044","Interest rate contracts, Row 8"]
["PDP0045","Foreign exchange contracts, Row 8"]
["PDP0046","Precious metals contracts, Row 8"]
["PDP0047","Other commodity contracts, Row 8"]
["PDP0047A","Virtual assets contracts, Row 8"]
["PDP0048"]
["PDP1013","Total, Row 8"]
["PDP0049","Equity contracts, Row 9A"]
["PDP0050","Interest rate contracts, Row 9A"]
["PDP0051","Foreign exchange contracts, Row 9A"]
["PDP0052","Precious metals contracts, Row 9A"]
["PDP0053","Other commodity contracts, Row 9A"]
["PDP0053A","Virtual assets contracts, Row 9A"]
["PDP0054"]
["PDP1014","Total, Row 9A"]
["PDP0055","Equity contracts, Row 10A"]
["PDP0056","Interest rate contracts, Row 10A"]
["PDP0057","Foreign exchange contracts, Row 10A"]
["PDP0058","Precious metals contracts, Row 10A"]
["PDP0059","Other commodity contracts, Row 10A"]
["PDP0059A","Virtual assets contracts, Row 10A"]
["PDP0060"]
["PDP1015","Total, Row 10A"]
["PDP0069","Equity contracts, Row 9B"]
["PDP0070","Interest rate contracts, Row 9B"]
["PDP0071","Foreign exchange contracts, Row 9B"]
["PDP0072","Precious metals contracts, Row 9B"]
["PDP0073","Other commodity contracts, Row 9B"]
["PDP0073A","Virtual assets contracts, Row 9B"]
["PDP0067","Total, Row 9B"]
["PDP0074","Equity contracts, Row 10B"]
["PDP0075","Interest rate contracts, Row 10B"]
["PDP0076","Foreign exchange contracts, Row 10B"]
["PDP0077","Precious metals contracts, Row 10B"]
["PDP0078","Other commodity contracts, Row 10B"]
["PDP0078A","Virtual assets contracts, Row 10B"]
["PDP0068","Total, Row 10B"]
["PDP0061","Equity contracts, Row 11"]
["PDP0062","Interest rate contracts, Row 11"]
["PDP0063","Foreign exchange contracts, Row 11"]
["PDP0064","Precious metals contracts, Row 11"]
["PDP0065","Other commodity contracts, Row 11"]
["PDP0065A","Virtual assets contracts, Row 11"]
["PDP1016","Total, Row 11"]
["PDP0066A","A101"]
["PDP1028","A107"]
["PDP1017","Equity contracts, Row 12"]
["PDP1018","Interest rate contracts, Row 12"]
["PDP1019","Foreign exchange contracts, Row 12"]
["PDP1020","Precious metals contracts, Row 12"]
["PDP1021","Other commodity contracts, Row 12"]
["PDP1021A","Virtual assets contracts, Row 12"]
["PDP1022","Total, Row 12"]
["PDP1023","A102"]
["PDP1024","A103"]
["PDP1025","A104"]
["PDP1026","A105"]
["PDP1027","A106"]
["PDP1027A","A106A"]
["PDP1028","A107"]
["PDP0079A","A108"]
[]
["Form 10 Table 2"]
["Field ID","Display Label ID"]
["PDP0080","A200","Item no."]
["PDP0081","A201"]
["PDP0082","A202"]
["PDP0083","A203"]
["PDP0084","A204"]
["PDP0084A","A204A"]
["PDP1029","A205"]
["PDP0086","A206"]
["PDP0087","A207"]
["PDP0088","A208"]
["PDP0089","A209"]
["PDP0090","A210"]
["PDP0090A","A210A"]
["PDP1030","A211"]
["PDP0092","A212"]
["PDP0093","A213"]
["PDP0094","A214"]
["PDP0095","A215"]
["PDP0096","A216"]
["PDP0096A","A216A"]
["PDP1031","A217"]
["PDP0098","A218"]
["PDP0099","A219"]
["PDP0100","A220"]
["PDP0101","A221"]
["PDP0102","A222"]
["PDP0102A","A222A"]
["PDP1032","A223"]
[]
["Form 10 Table 3"]
["Field ID","Display Label ID"]
["PDP0106","1 year or less, Row 1","Item no."]
["PDP0107","Over 1 year through 5 years, Row 1"]
["PDP0108","Over 5 years, Row 1"]
["PDP1033","A300"]
["PDP0110","1 year or less, Row 2"]
["PDP0111","Over 1 year through 5 years, Row 2"]
["PDP0112","Over 5 years, Row 2"]
["PDP1034","A301"]
["PDP0114","1 year or less, Row 3"]
["PDP0115","Over 1 year through 5 years, Row 3"]
["PDP0116","Over 5 years, Row 3"]
["PDP1035","A302"]
["PDP0118","1 year or less, Row 4"]
["PDP0119","Over 1 year through 5 years, Row 4"]
["PDP0120","Over 5 years, Row 4"]
["PDP1036","A303"]
["PDP0122","1 year or less, Row 5"]
["PDP0123","Over 1 year through 5 years, Row 5"]
["PDP0124","Over 5 years, Row 5"]
["PDP1037","A304"]
["PDP0125","1 year or less, Row 6"]
["PDP0169","Over 1 year through 5 years, Row 6"]
["PDP0170","Over 5 years, Row 6"]
["PDP1050","A305"]
[]
["Form 10 Table 4"]
["Field ID","Display Label ID"]
["PDP0126","Aggregate gross positive market value, Row 1","Item no."]
["PDP0127","Aggregate of current credit exposure, Row 1"]
["PDP0128","Aggregate of collateral, Row 1"]
["PDP0129","Aggregate amount of guarantees, Row 1"]
["PDP0130","Credit equivalent amount after collateral and guarantees, Row 1"]
["PDP0131","Aggregate gross positive market value, Row 2"]
["PDP0132","Aggregate of current credit exposure, Row 2"]
["PDP0133","Aggregate of collateral, Row 2"]
["PDP0134","Aggregate amount of guarantees, Row 2"]
["PDP0135","Credit equivalent amount after collateral and guarantees, Row 2"]
["PDP0136","Aggregate gross positive market value, Row 3"]
["PDP0137","Aggregate of current credit exposure, Row 3"]
["PDP0138","Aggregate of collateral, Row 3"]
["PDP0139","Aggregate amount of guarantees, Row 3"]
["PDP0140","Credit equivalent amount after collateral and guarantees, Row 3"]
["PDP0141"]
["PDP1038","A400"]
["PDP0142"]
["PDP1039","A401"]
["PDP0143"]
["PDP1040","A402"]
["PDP0144"]
["PDP1041","A403"]
["PDP0145"]
["PDP1042","A404"]
[]
["Form 10 Table 5"]
["Field ID","Display Label ID"]
["PDP0146","A500","Item no."]
["PDP0147","A501"]
["PDP0148","A502"]
["PDP0148A","A503"]
[]
["Form 10 Table 6"]
["Field ID","Display Label ID"]
["PDP0149","A600","Item no."]
["PDP0150","A601","(a)"]
["PDP0151","A602","(a)"]
["PDP0152","A603","(a)"]
["PDP0153","A604","(a)"]
["PDP0153A","A604A","(a)"]
["PDP0154","A605","(a)"]
["PDP0155","A606","(a)"]
["PDP0156","A607","(b)"]
["PDP0157","A608","(b)"]
["PDP0158","A609","(b)"]
["PDP0159","A610","(b)"]
["PDP0159A","A610A","(b)"]
["PDP0160","A611","(b)"]
["PDP0160A","A606A","(b)"]
["PDP1043","A612","(b)"]
["PDP1044","A613","(c)"]
["PDP1045","A614","(c)"]
["PDP1046","A615","(c)"]
["PDP1047","A616","(c)"]
["PDP1047A","A616A","(c)"]
["PDP1048","A617","(c)"]
["PDP0167","A618","(c)"]
["PDP1049","A619","(d)"]
["PDP0168A","A620","(e)"]
[null,null,"Note 1"]
["Form 11"]
["Field ID","Display Label ID"]
["LRC0001","Name of recognized counterparty in Form 11","Item no."]
["LRC0002","Qualifying criteria in Form 11"]
[]
["Form 12"]
["Field ID","Display Label ID"]
["OI0001","C100A","Item no."]
["OI0001A","C100B"]
["OI0002","C101"]
["OI0003","C102","A"]
["OI0004","C103","A"]
["OI0005","C104","A"]
["OI1001","C105A","A"]
["OI0006","C105B","A"]
["OI0007","C105C","A"]
["OI0007D","C105D","A"]
["OI0008","C106","B"]
["OI1002","C106A"]
["OI1003","C106B"]
["OI1004","C106C"]
["OI1005","C106D"]
["OI1006","C106E"]
["OI1007","C106F"]
["OI1008","C106G"]
["OI1009","C106H"]
["OI1012","C106HA"]
["OI1010","C106I"]
["OI1017","C107A"]
["OI1018","C108A"]
["OI1024A","C107B","B"]
["OI1024B","C108B"]
["OI0009A","C109A"]
["OI0009B","C109B"]
["OI0009C","C109C"]
["OI0009D","C109D"]
["OI1011","C110"]
["OI1025","C111","B"]
["OI1013","C112"]
["OI1014","C113"]
["OI0014","C114","A"]
["OI0015","C115"]
["OI0016","C116"]
["OI0017","C117"]
["OI0018","C118"]
["OI1020","C119"]
["OI1021","C120"]
["OI1022","C121"]
["OI1023","C122"]
["OI0021A","Form 12 A Hong Kong row 1"]
["OI0021B","Form 12 A Mainland China  row 1"]
["OI0021C","Form 12 A Others row 1"]
["OI0021D","Form 12 A Other Asia Pacific locations row 1"]
["OI0021E","Form 12 A United States of America row 1"]
["OI0022A","Form 12 A Hong Kong row 2"]
["OI0022B","Form 12 A Mainland China  row 2"]
["OI0022C","Form 12 A Others row 2"]
["OI0022D","Form 12 A Other Asia Pacific locations row 2"]
["OI0022E","Form 12 A United States of America row 2"]
["OI0023A","Form 12 A Hong Kong row 3"]
["OI0023B","Form 12 A Mainland China  row 3"]
["OI0023C","Form 12 A Others row 3"]
["OI0023D","Form 12 A Other Asia Pacific locations row 3"]
["OI0023E","Form 12 A United States of America row 3"]
["OI0024A","Form 12 A Hong Kong row 4"]
["OI0024B","Form 12 A Mainland China  row 4"]
["OI0024C","Form 12 A Others row 4"]
["OI0024D","Form 12 A Other Asia Pacific locations row 4"]
["OI0024E","Form 12 A United States of America row 4"]
["OI0025A","Form 12 A Hong Kong row 5"]
["OI0025B","Form 12 A Mainland China  row 5"]
["OI0025C","Form 12 A Others row 5"]
["OI0025D","Form 12 A Other Asia Pacific locations row 5"]
["OI0025E","Form 12 A United States of America row 5"]
["OI0026A","Form 12 A Hong Kong row 6"]
["OI0026B","Form 12 A Mainland China  row 6"]
["OI0026C","Form 12 A Others row 6"]
["OI0026D","Form 12 A Other Asia Pacific locations row 6"]
["OI0026E","Form 12 A United States of America row 6"]
["OI0027A","Form 12 A Hong Kong row 7"]
["OI0027B","Form 12 A Mainland China  row 7"]
["OI0027C","Form 12 A Others row 7"]
["OI0027D","Form 12 A Other Asia Pacific locations row 7"]
["OI0027E","Form 12 A United States of America row 7"]
["OI0028A","Form 12 A Hong Kong row 8"]
["OI0028B","Form 12 A Mainland China  row 8"]
["OI0028C","Form 12 A Others row 8"]
["OI0028D","Form 12 A Other Asia Pacific locations row 8"]
["OI0028E","Form 12 A United States of America row 8"]
["OI0029A","Form 12 A Hong Kong row 9"]
["OI0029B","Form 12 A Mainland China  row 9"]
["OI0029C","Form 12 A Others row 9"]
["OI0029D","Form 12 A Other Asia Pacific locations row 9"]
["OI0029E","Form 12 A United States of America row 9"]
["OI0031A","Form 12 A Hong Kong row 9a"]
["OI0031B","Form 12 A Mainland China  row 9a"]
["OI0031C","Form 12 A Others row 9a"]
["OI0031D","Form 12 A Other Asia Pacific locations row 9a"]
["OI0031E","Form 12 A United States of America row 9a"]
["OI0030A","Form 12 A Hong Kong row 10"]
["OI0030B","Form 12 A Mainland China  row 10"]
["OI0030C","Form 12 A Others row 10"]
["OI0030D","Form 12 A Other Asia Pacific locations row 10"]
["OI0030E","Form 12 A United States of America row 10"]
["OI1007A","Form 12 Bi row 11 col 1"]
["OI1007B","Form 12 Bi row 11 col 2"]
["OI1007C","Form 12 Bi row 11 col 5"]
["OI1007D","Form 12 Bi row 11 col 6"]
["OI1007E","Form 12 Bi row 11 col 7"]
["OI1007F","Form 12 Bi row 11 col 8"]
["OI1007G","Form 12 Bi row 11 col 3"]
["OI1007H","Form 12 Bi row 11 col 4"]
["OI1008A","Form 12 Bi row 12 col 1"]
["OI1008B","Form 12 Bi row 12 col 2"]
["OI1008C","Form 12 Bi row 12 col 5"]
["OI1008D","Form 12 Bi row 12 col 6"]
["OI1008E","Form 12 Bi row 12 col 7"]
["OI1008F","Form 12 Bi row 12 col 8"]
["OI1008G","Form 12 Bi row 12 col 3"]
["OI1008H","Form 12 Bi row 12 col 4"]
["OI1009A","Form 12 Bi row 13 col 1"]
["OI1009B","Form 12 Bi row 13 col 2"]
["OI1009C","Form 12 Bi row 13 col 5"]
["OI1009D","Form 12 Bi row 13 col 6"]
["OI1009E","Form 12 Bi row 13 col 7"]
["OI1009F","Form 12 Bi row 13 col 8"]
["OI1009G","Form 12 Bi row 13 col 3"]
["OI1009H","Form 12 Bi row 13 col 4"]
["OI1012A","Form 12 Bi row 13a col 1"]
["OI1012B","Form 12 Bi row 13a col 2"]
["OI1012C","Form 12 Bi row 13a col 5"]
["OI1012D","Form 12 Bi row 13a col 6"]
["OI1012E","Form 12 Bi row 13a col 7"]
["OI1012F","Form 12 Bi row 13a col 8"]
["OI1012G","Form 12 Bi row 13a col 3"]
["OI1012H","Form 12 Bi row 13a col 4"]
["OI1010A","Form 12 Bi row 14 col 1"]
["OI1010B","Form 12 Bi row 14 col 2"]
["OI1010C","Form 12 Bi row 14 col 5"]
["OI1010D","Form 12 Bi row 14 col 6"]
["OI1010E","Form 12 Bi row 14 col 7"]
["OI1010F","Form 12 Bi row 14 col 8"]
["OI1010G","Form 12 Bi row 14 col 3"]
["OI1010H","Form 12 Bi row 14 col 4"]